program: Gaussian 09
title: 000270007
version: EM64L-G09RevD.01
frameworkgroup: C1[X(C8H8N4)]
method: RPBEPBE
basis: SDD
operation: Freq
keyword: #p
keyword: freq=noraman
keyword: PBEPBE/SDD
title: #p freq=noraman PBEPBE/SDD
converged: NO NO NO NO
title: Mulliken charges:
elementType: N N N N C C C C C C C C H H H H H H H H
charge: -0.241192 -0.040901 -0.108232 -0.092303 0.460840 0.451693 -0.342901 -0.354147 -0.380787 -0.363660 -0.800731 -0.164286 0.227864 0.289505 0.238699 0.240956 0.230775 0.228629 0.242229 0.277950
chargesum: 0.00000
title: Mulliken charges with hydrogens summed into heavy atoms:
elementType: N N N N C C C C C C C C
charge: -0.241192 -0.040901 -0.108232 -0.092303 0.460840 0.451693 -0.115037 -0.064642 -0.142088 -0.122704 -0.099098 0.113664
polarizability: 1.81189829e+02 -7.24683652e-01 1.09987926e+02 5.22068885e-01 -1.44631952e-02 4.92597880e+01
1716.lowfreq: -48.6812 -22.0822 -10.9091 -0.0008 -0.0007 -0.0006 2.9870 7.7570 80.4419
frequency: -48.3117 -21.8586 80.4078 151.4923 196.8855 316.5694 324.3244 350.3013 403.0790 443.9599 513.0774 603.5350 633.4910 647.6903 669.0760 715.1462 791.5374 792.6833 819.9857 846.9019 847.8092 903.8832 952.8537 976.8299 987.1610 988.7502 995.2798 1017.5068 1047.9468 1103.7507 1120.6304 1151.2089 1196.5107 1203.1578 1226.7633 1314.7908 1334.0169 1383.9728 1395.9057 1399.8071 1422.7369 1472.6076 1473.4213 1513.0199 1593.6581 1624.6587 2980.9601 3063.1029 3092.5683 3134.0036 3138.6372 3158.8903 3183.2104 3277.3655
redmass: 1.0265 4.7396 4.9075 5.2951 5.2473 5.0539 3.6928 4.4116 2.8621 4.6572 2.7117 5.2998 6.9191 3.2162 11.8589 2.9705 4.9016 1.6221 1.4086 5.6530 1.3641 9.4809 1.3432 8.3393 1.3790 1.4095 8.7897 2.8195 1.5714 3.8482 1.8237 1.5972 1.4289 2.1712 2.8807 1.4301 3.2719 6.9578 3.4693 1.3163 3.0437 1.1189 1.0567 2.8909 6.7898 6.3525 1.0391 1.0947 1.1000 1.0882 1.0906 1.0964 1.0950 1.1001
irintensity: 0.6061 3.3239 0.8148 3.9938 4.3593 1.7358 0.9066 0.7893 0.0204 0.5332 28.0371 2.3998 0.6080 1.4073 1.6676 0.7073 0.6637 16.6988 61.5775 4.9648 16.3484 75.1541 2.7328 2.5223 2.1772 0.7521 7.4198 1.9778 19.5382 4.7819 20.3847 42.2537 0.6674 4.2839 2.1786 2.8346 3.5646 0.8352 8.9697 23.2622 1.1100 14.3710 13.6005 97.5689 1.5370 1.0772 26.8934 19.9392 15.6822 11.5326 17.5954 9.7447 0.2500 2.3024
temp: 298.150 k
press: 1.00000 atm
elementType: 7 7 7 7 6 6 6 6 6 6 6 6 1 1 1 1 1 1 1 1
symmnumber: 1
zpe: 394633.2 jmol-1
zpe.correction: 0.150308 hartree
zpe.thermalcorrener: 0.158601 hartree
zpe.thermalcorrenthalpy: 0.159545 hartree
zpe.thermalcorrgfe: 0.116518 hartree
zpe.sumelectzpe: -527.751611 hartree
zpe.sumelectthermal: -527.743318 hartree
zpe.sumelectthermalent: -527.742374 hartree
zpe.sumelectthermalfe: -527.785401 hartree
dipole: 6.8407 2.4477 0.0560
dipole: 7.2656
quadrupole: -85.1745 -63.7356 -72.4095
quadrupole: -5.3934 0.3185 -0.0218
quadrupole: -11.4013 10.0376 1.3637 -5.3934 0.3185 -0.0218
hfenergy: -527.9019189 hartree
pointgroup: C01 [X(C8H8N4)]
dipole: -2.6896491 0.9678057 -0.0156298 debye
dipolederiv: -0.7056916 0.0773287 0.0042163 0.1776785 -0.1763532 0.0002435 0.001132 0.0000437 0.0829049 0.3162577 -0.2946858 0.0002477 -0.4735169 -0.0804541 0.0006598 -0.0026199 0.0022431 -0.0902001 -0.4728953 0.0995676 -0.0012505 0.2801645 -0.3063096 0.0004298 0.0009841 -0.0000791 -0.1760035 -0.4959367 0.0367731 -0.0005888 -0.28732 0.2008098 -0.001013 0.0047927 -0.0014253 -0.1755382 0.7483108 -0.0088081 -0.0063277 0.0402159 0.0405707 -0.0004492 -0.0024219 -0.0000346 0.05387 0.487105 0.0069122 0.0198692 0.0441006 -0.051774 -0.0003429 0.0977629 0.0023023 -0.0234247 -0.0618211 0.0204829 0.0010151 0.0191473 0.0105158 0.0050512 -0.0070078 0.0032185 -0.1421246 -0.0869234 -0.0341916 0.0016813 -0.0477839 -0.0163388 -0.0039345 -0.0077146 -0.0018151 -0.1218508 -0.2116571 -0.0550286 0.0005022 -0.2417424 0.0840467 -0.0067633 -0.0071557 -0.0072949 -0.1592602 -0.1739843 0.0691431 0.0001744 0.2158152 0.1164056 0.0077101 -0.0076303 0.0061318 -0.157708 -0.194015 -0.0055807 -0.0151475 -0.0083834 0.0766593 0.0010743 -0.154676 -0.0010796 0.0593625 0.5434437 0.0589376 -0.0017016 0.2497998 0.0847437 -0.0004341 -0.0038735 -0.0015851 -0.0313871 0.0315763 -0.1023734 0.000734 -0.0979941 -0.0242274 -0.0009067 0.0028696 -0.0015511 0.1627716 0.1008228 0.0598105 0.0008079 0.0604658 0.0514238 0.0003312 0.0036547 0.0009989 0.171363 0.0125813 0.0900117 0.0034094 0.0933547 -0.0419809 0.0010007 0.0065053 -0.0033429 0.1504178 0.0189814 -0.0885565 0.0031857 -0.0913319 -0.0435991 -0.0013997 0.0060527 0.003227 0.1481718 0.022186 -0.0195772 0.0186738 -0.0951384 -0.0597843 0.0984783 0.0814695 0.0785562 0.065975 0.0166695 0.0228698 0.0221289 0.1006006 -0.0585168 -0.0978184 0.0835647 -0.0759732 0.0662817 -0.034545 -0.0031111 -0.052116 -0.0028341 0.1170786 -0.0018733 -0.0961947 -0.0029382 -0.0901523 0.1395352 0.0700758 0.0004861 0.0647022 0.0770841 -0.0000438 0.000506 0.0003974 0.2065311 unknown
polarizability: 181.1938773|0.597491|109.98555|0.2237957|0.0328633|49.2581163 unknown
InChI: InChI=1S/C8H8N4/c1-7-2-4-8(5-3-7)12-6-9-10-11-12/h2-6H,1H3
charge 0 multiplicity 1
20 atoms
N  1.435707 0.064663 -0.002887
N  2.174742 -1.14786 -0.002481
N  3.599848 0.621513 -0.01749
N  3.469924 -0.7912 -0.01191
C  0.000182 0.050706 0.002542
C  -2.845107 -0.000597 0.015639
C  -0.727466 1.263416 0.008905
C  -0.681184 -1.188342 0.005612
C  -2.136571 1.227896 0.016849
C  -2.089146 -1.201649 0.013675
C  -4.361999 -0.029233 -0.00757
C  2.33488 1.105398 -0.007048
H  -0.215486 2.231069 0.011969
H  -0.105895 -2.117551 0.005234
H  -2.693413 2.17175 0.024797
H  -2.610638 -2.165504 0.0190
H  -4.758371 -0.928435 0.494568
H  -4.793542 0.857401 0.488009
H  -4.740725 -0.040992 -1.047824
H  2.081757 2.159452 -0.007791
