program: Gaussian 09
title: 000269976
version: EM64L-G09RevD.01
frameworkgroup: C1[X(C13H24N2O)]
method: RPBEPBE
basis: SDD
operation: Freq
keyword: #p
keyword: freq=noraman
keyword: PBEPBE/SDD
title: #p freq=noraman PBEPBE/SDD
converged: YES YES NO NO
title: Mulliken charges:
elementType: O N N C C C C C C C C C C C C C H H H H H H H H H H H H H H H H H H H H H H H H
charge: -0.258907 -0.199405 -0.028356 -0.352676 -0.372288 -0.377492 -0.374091 -0.381801 -0.351745 -0.356412 -0.506651 -0.505102 0.216306 0.204636 -0.696551 -0.776459 0.201019 0.193284 0.187921 0.187870 0.217934 0.198331 0.187477 0.192290 0.226608 0.241396 0.187440 0.186189 0.258117 0.239640 0.196054 0.194018 0.236849 0.239380 0.214785 0.208906 0.209839 0.228274 0.228913 0.254460
chargesum: 0.00000
title: Mulliken charges with hydrogens summed into heavy atoms:
elementType: O N N C C C C C C C C C C C C C
charge: -0.258907 -0.199405 -0.028356 0.041628 0.003502 0.038772 0.005676 0.086204 0.021884 0.033660 -0.008894 -0.028873 0.216306 0.204636 -0.063022 -0.064812
polarizability: 1.67375077e+02 1.33353911e+01 1.60635282e+02 2.85579581e+00 -3.76755988e+00 1.44814100e+02
1716.lowfreq: -6.1069 -0.0001 0.0003 0.0008 7.2404 8.7569 16.9289 22.3457 35.0374
frequency: 16.3555 21.7340 34.5919 53.1037 73.8714 85.5094 89.0313 112.9191 137.8524 146.2688 163.5560 171.9332 184.5956 222.7455 227.1853 278.0044 303.7929 325.1501 339.2121 377.8297 425.1087 448.1191 457.1725 482.2504 509.3531 545.1029 595.0744 646.5142 719.3906 726.7480 736.6557 757.6233 777.6529 816.6994 855.5786 863.6970 889.9139 911.9495 955.8055 966.0610 979.3486 1004.1857 1009.5960 1024.5153 1033.6830 1051.1733 1062.9625 1066.5228 1080.1577 1086.3258 1120.1393 1127.6373 1153.9011 1164.9369 1192.3708 1200.8906 1218.4187 1235.5396 1253.0085 1260.5265 1271.7681 1280.9662 1281.9326 1292.9868 1294.3477 1308.6646 1315.4140 1337.6702 1348.8702 1354.5071 1356.8113 1363.5151 1372.2870 1385.8802 1393.0295 1448.6114 1450.5820 1452.4531 1454.8673 1457.5541 1460.8616 1462.4225 1462.8328 1468.0396 1475.2770 1475.9501 1482.7351 1488.0943 1596.7559 1607.0495 2948.2890 2949.7598 2956.5786 2962.7277 2965.4245 2967.7747 2969.6991 2970.7025 2975.1254 2983.5083 2992.1892 2992.4839 3006.7419 3012.3947 3019.7117 3033.3640 3041.1355 3046.2633 3054.0738 3067.5777 3069.6974 3088.8820 3092.7366 3111.4426
redmass: 3.8961 3.0383 2.1697 2.9305 3.4207 2.5602 2.3808 2.4532 1.9359 2.3715 2.1953 2.7942 1.2091 2.8184 1.1702 2.9523 2.5233 3.4904 3.1208 3.1784 2.7326 3.9759 2.9893 3.6872 3.1137 4.4355 3.0850 3.8602 1.0667 1.1238 3.1978 1.2421 2.3584 1.3665 2.1564 1.8878 1.8479 1.3730 3.2179 1.6118 1.5358 2.8110 1.4045 2.2201 2.5360 1.7719 2.5239 2.2138 2.0513 2.2096 2.4691 2.9605 1.2521 2.2760 1.6357 1.8530 1.3228 1.4178 1.5532 1.6930 1.2868 1.0389 1.3256 1.0998 1.1325 1.6204 1.4328 1.7609 1.5170 1.6512 1.4144 1.6085 2.2023 1.2186 1.3282 1.0936 1.0967 1.0857 1.0803 1.0822 1.0743 1.0555 1.0691 1.0803 1.0722 1.0487 1.0856 1.0904 9.6378 6.2207 1.0591 1.0589 1.0592 1.0648 1.0596 1.0589 1.0408 1.0366 1.0594 1.0967 1.0992 1.0662 1.0982 1.0705 1.0973 1.1039 1.0969 1.1038 1.0939 1.1007 1.0993 1.1019 1.0953 1.0977
irintensity: 0.8485 0.1630 0.1632 0.4242 0.5766 3.9587 1.6949 0.5802 0.0791 1.4737 2.3174 1.2054 0.0763 0.8646 0.0559 2.2487 1.2269 2.0380 8.7369 7.6110 2.1402 9.9420 0.4344 6.7791 6.2805 0.7028 2.7282 4.7639 15.2461 0.5060 16.6048 3.7703 2.6141 1.3245 15.5624 2.7959 3.7599 1.8038 20.7889 4.3280 4.3023 3.9351 0.2411 4.6507 10.2201 2.5776 2.4258 4.8020 0.3273 6.2517 8.9978 27.1899 3.5421 18.7584 4.4778 48.0088 9.8307 8.0708 24.1261 4.7810 4.7105 1.6125 13.8851 2.1968 2.3395 18.8146 11.8995 58.6236 6.7342 2.6049 4.9729 7.2219 35.2856 11.1844 18.1783 9.6214 34.1513 10.8336 18.3794 2.6679 0.2758 10.2281 0.5584 1.7552 3.4661 9.9827 4.0565 23.6808 248.3356 7.3944 1.6151 1.3943 19.6651 11.1533 3.9303 95.4550 35.6205 35.7438 93.5351 0.7985 0.6340 17.2920 2.4885 30.1770 9.6865 25.5906 17.7297 157.8134 26.8979 98.4079 54.4249 8.9174 8.9009 12.5303
temp: 298.150 k
press: 1.00000 atm
elementType: 8 7 7 6 6 6 6 6 6 6 6 6 6 6 6 6 1 1 1 1 1 1 1 1 1 1 1 1 1 1 1 1 1 1 1 1 1 1 1 1
symmnumber: 1
zpe: 922671.2 jmol-1
zpe.correction: 0.351427 hartree
zpe.thermalcorrener: 0.370258 hartree
zpe.thermalcorrenthalpy: 0.371202 hartree
zpe.thermalcorrgfe: 0.301407 hartree
zpe.sumelectzpe: -693.214286 hartree
zpe.sumelectthermal: -693.195455 hartree
zpe.sumelectthermalent: -693.194510 hartree
zpe.sumelectthermalfe: -693.264306 hartree
dipole: 1.1248 3.5030 -0.3063
dipole: 3.6919
quadrupole: -92.2414 -101.2130 -101.6130
quadrupole: 11.4901 2.6024 8.5259
quadrupole: 6.1144 -2.8572 -3.2572 11.4901 2.6024 8.5259
hfenergy: -693.5657127 hartree
pointgroup: C01 [X(C13H24N2O1)]
dipole: 0.3875489 -1.3733512 0.271154 debye
polarizability: 166.3940419|-13.7339151|160.6910652|-1.3286663|-5.4896896|145.7393525 unknown
InChI: InChI=1S/C13H24N2O/c1-3-4-5-6-7-8-11-15-13(16)10-9-12(2)14-15/h3-11H2,1-2H3
charge 0 multiplicity 1
40 atoms
O  2.140138 1.874304 -1.670753
N  2.191953 0.605721 0.292554
N  2.626964 -0.51105 1.060803
C  -0.912169 0.979275 0.396633
C  -2.30011 0.497402 0.874743
C  0.088897 1.16982 1.556619
C  -3.31211 0.311193 -0.278436
C  1.491522 1.628304 1.103568
C  -4.698631 -0.179901 0.195573
C  -5.712289 -0.35842 -0.957909
C  3.365886 -0.261245 -1.697287
C  3.071143 -1.654588 -1.103571
C  2.50219 0.82594 -1.056938
C  3.049434 -1.57862 0.414785
C  -7.094857 -0.85014 -0.477152
C  3.492593 -2.762461 1.237084
H  -1.02063 1.933581 -0.157979
H  -0.500572 0.248442 -0.329147
H  -2.710229 1.22498 1.606639
H  -2.18652 -0.461757 1.422775
H  0.192409 0.226708 2.12925
H  -0.302758 1.929664 2.263621
H  -2.899803 -0.410427 -1.014763
H  -3.429636 1.272357 -0.82121
H  2.12296 1.841302 1.98537
H  1.425171 2.533177 0.476423
H  -5.110268 0.539184 0.934764
H  -4.582746 -1.144399 0.733509
H  3.196527 -0.228461 -2.785326
H  4.426239 0.01096 -1.522196
H  -5.827134 0.606385 -1.493125
H  -5.299643 -1.075173 -1.697327
H  3.810677 -2.399449 -1.446246
H  2.077623 -2.010715 -1.451386
H  -7.799635 -0.969247 -1.320784
H  -7.011689 -1.827551 0.034875
H  -7.542337 -0.134874 0.238781
H  4.56498 -2.983123 1.070302
H  2.929865 -3.671959 0.948907
H  3.333696 -2.567244 2.309357
