program: Gaussian 09
title: 000269962
version: EM64L-G09RevD.01
frameworkgroup: C1[X(C22H17N3O)]
method: RPBEPBE
basis: SDD
operation: Freq
keyword: #p
keyword: freq=noraman
keyword: PBEPBE/SDD
title: #p freq=noraman PBEPBE/SDD
converged: YES YES NO NO
title: Mulliken charges:
elementType: O N N N C C C C C C C C C C C C C C C C C C C C C C H H H H H H H H H H H H H H H H H
charge: -0.259859 -0.231211 -0.395845 -0.054540 0.219771 0.231968 0.232160 0.169169 -0.392077 -0.545381 -0.335287 0.516795 -0.365298 -0.387551 -0.466597 -0.657436 -0.223738 -0.253304 -0.000019 0.214060 0.037311 -0.110633 -0.297745 -0.335252 -0.293233 -0.187715 0.228940 0.226489 0.275272 0.244416 0.238678 0.240380 0.251670 0.224063 0.235776 0.233283 0.347804 0.228214 0.230198 0.248078 0.260135 0.229600 0.228492
chargesum: 0.00000
title: Mulliken charges with hydrogens summed into heavy atoms:
elementType: O N N N C C C C C C C C C C C C C C C C C C C C C C
charge: -0.259859 -0.231211 -0.048041 -0.054540 0.219771 0.231968 0.232160 0.169169 0.063352 -0.270109 -0.090871 0.516795 -0.126620 -0.147171 -0.214927 0.035686 0.004476 -0.023106 -0.000019 0.214060 0.037311 -0.110633 -0.049667 -0.075117 -0.063633 0.040777
polarizability: 5.23728028e+02 6.09574148e-01 3.38769644e+02 6.23045685e-02 1.26992694e+01 1.31106205e+02
1716.lowfreq: 0.0006 0.0007 0.0008 0.6182 1.9810 5.3471 19.2715 34.3306 39.4640
frequency: 19.2627 34.3289 39.4635 46.6971 77.3373 107.2585 118.1986 122.2938 137.9715 179.2412 181.0784 205.8005 229.3378 259.0098 271.7581 286.9508 293.9372 345.6849 352.0602 392.4476 420.3619 429.0474 443.8603 452.2013 476.5199 496.7417 506.0099 541.4088 551.0665 561.6303 578.1495 589.0990 616.1486 625.9020 633.6964 664.4423 704.9535 709.8758 721.4567 737.6438 742.1866 753.6668 755.4171 769.4886 773.8198 776.2330 805.4327 854.6585 856.6016 864.5614 871.4183 883.2332 896.3110 901.8112 936.7772 940.3893 940.8503 953.0528 957.1956 978.7190 986.6103 1004.8320 1008.7909 1021.8789 1058.0848 1081.2451 1087.6616 1116.5291 1126.6014 1136.8351 1147.8711 1156.5926 1170.1822 1176.3372 1213.9942 1236.0363 1238.8933 1258.6274 1279.5315 1289.2812 1302.6164 1332.3585 1344.7362 1347.6570 1363.3401 1386.6374 1392.4983 1404.7154 1406.7471 1444.6093 1449.4537 1461.9504 1469.1661 1479.7818 1489.5417 1491.9801 1497.4889 1509.2527 1519.4294 1576.0475 1588.5834 1598.9755 1614.1668 1625.9302 1639.6615 1655.6687 2991.3198 3009.8962 3059.4479 3091.2259 3099.1630 3128.6631 3130.5985 3136.2560 3137.4004 3141.4553 3150.8861 3160.2213 3163.3862 3168.2077 3173.6046 3174.7926 3194.8929
redmass: 5.1378 4.7782 5.9419 2.9637 3.8485 4.5821 5.0267 4.9695 6.9128 4.8222 3.4391 1.4150 4.9876 3.6199 6.3476 4.4841 2.3740 4.9238 5.3748 4.1712 3.5748 3.8056 4.9449 3.0666 8.6332 3.5407 6.5531 4.1991 4.2243 6.0540 3.9917 4.4122 4.1432 5.5460 7.2294 7.2489 5.3077 5.3283 4.9190 2.6831 5.3777 1.4783 1.8992 4.0333 2.1734 1.5958 1.5231 5.7753 1.4511 1.5430 2.9619 5.4133 1.4002 1.5692 1.6795 2.1316 1.3999 1.4011 2.5271 1.3178 1.3431 2.7872 2.3053 1.9756 4.1171 3.1326 2.1423 3.1572 1.6966 1.6488 2.0516 1.4315 1.1588 1.2738 2.2137 1.9219 2.6563 2.3037 1.3308 1.6318 1.8045 2.2799 1.4629 3.2236 2.3967 2.4797 1.2435 4.6467 3.2364 2.8220 3.0790 2.8679 1.0643 1.0856 3.7319 1.3991 2.5701 2.3863 4.8288 7.4372 6.7981 5.9310 6.3566 5.9905 7.4983 9.6328 1.0356 1.0605 1.1029 1.0997 1.1021 1.0863 1.0855 1.0885 1.0896 1.0890 1.0951 1.0966 1.0961 1.1001 1.0957 1.0942 1.0736
irintensity: 1.3225 1.3512 0.3314 0.2615 1.3552 0.0489 4.7915 0.3826 0.0941 2.1650 0.1316 0.7878 2.8420 2.7559 0.4528 0.5761 2.0121 0.1750 1.6740 0.8918 16.2731 2.2930 2.9925 2.6443 35.6552 13.6012 13.2283 0.6617 7.5666 11.0472 1.0986 1.1758 14.3137 8.7815 5.2073 9.8682 9.4637 5.4720 1.3633 11.3790 47.5563 81.4965 62.1871 6.0289 10.7328 6.1551 38.8548 34.2951 0.7066 7.0941 4.9265 34.1598 58.5455 29.3606 13.8754 5.1450 0.9668 1.1753 25.3009 0.0022 1.7686 1.5273 8.2882 9.4788 14.8252 70.4913 5.4742 80.8639 7.8197 41.4060 158.3355 15.9080 5.0182 25.9871 39.4398 36.5420 55.3138 245.4619 1.9603 85.9231 5.8919 46.8629 92.3646 77.5372 144.4573 203.5669 21.6407 77.7259 33.6732 87.3827 44.5744 20.9579 13.3412 1.9335 69.8614 13.2337 54.7405 3.2072 223.2096 48.0131 14.3677 39.1939 122.4707 271.3241 17.7789 350.5346 23.8634 46.8254 2.5730 49.0843 23.8050 8.9524 1.3870 3.7811 2.0860 6.8600 24.8246 14.5507 16.8245 29.3642 16.1145 11.3924 54.1408
temp: 298.150 k
press: 1.00000 atm
elementType: 8 7 7 7 6 6 6 6 6 6 6 6 6 6 6 6 6 6 6 6 6 6 6 6 6 6 1 1 1 1 1 1 1 1 1 1 1 1 1 1 1 1 1
symmnumber: 1
zpe: 877299.3 jmol-1
zpe.correction: 0.334146 hartree
zpe.thermalcorrener: 0.354687 hartree
zpe.thermalcorrenthalpy: 0.355632 hartree
zpe.thermalcorrgfe: 0.283574 hartree
zpe.sumelectzpe: -1086.257014 hartree
zpe.sumelectthermal: -1086.236472 hartree
zpe.sumelectthermalent: -1086.235528 hartree
zpe.sumelectthermalfe: -1086.307586 hartree
dipole: 11.6645 2.0247 2.3075
dipole: 12.0617
quadrupole: -166.7983 -137.6495 -157.4714
quadrupole: -30.6594 -6.2107 -4.9916
quadrupole: -12.8253 16.3236 -3.4983 -30.6594 -6.2107 -4.9916
hfenergy: -1086.59116 hartree
pointgroup: C01 [X(C22H17N3O1)]
dipole: -4.6246832 -0.6774356 0.8200358 debye
polarizability: 523.5148259|-4.9758558|339.4214035|5.4361383|-7.440849|130.6676482 unknown
InChI: InChI=1S/C22H17N3O/c1-2-25-19-10-6-4-7-15(19)17-13-14(11-12-20(17)25)23-21-16-8-3-5-9-18(16)24-22(21)26/h3-13,23H,2H2,1H3
charge 0 multiplicity 1
43 atoms
O  4.269588 2.758812 -0.712556
N  -3.724927 0.985039 0.091827
N  1.838696 1.687172 -0.128153
N  5.282316 0.622194 -0.201145
C  -2.367122 1.331446 0.097083
C  -1.583194 0.164457 -0.225356
C  -3.838062 -0.390525 -0.209063
C  -2.523409 -0.931119 -0.424202
C  -4.842683 1.882484 0.422605
C  -0.180784 0.257114 -0.301346
C  -1.756872 2.584147 0.334644
C  0.430648 1.507599 -0.044206
C  -4.996414 -1.189664 -0.314195
C  -2.374892 -2.297322 -0.756273
C  -0.35608 2.6617 0.256902
C  -5.17982 1.898386 1.930053
C  -4.82272 -2.550695 -0.647525
C  -3.528761 -3.101351 -0.867215
C  2.880048 0.854306 -0.000388
C  3.184727 -0.476186 0.37942
C  4.657456 -0.54265 0.235311
C  4.268837 1.534933 -0.355021
C  2.453859 -1.595212 0.886501
C  5.32221 -1.756554 0.569187
C  3.144588 -2.765488 1.220819
C  4.568812 -2.839257 1.048048
H  -5.72266 1.563801 -0.164462
H  -4.58405 2.899074 0.075128
H  0.422768 -0.6019 -0.604711
H  -2.34233 3.476018 0.576539
H  -5.998488 -0.782815 -0.143885
H  -1.38218 -2.727963 -0.92841
H  0.146869 3.617042 0.445176
H  -6.027875 2.579803 2.123543
H  -5.458229 0.890231 2.283094
H  -4.316689 2.243039 2.525891
H  2.186955 2.64035 -0.381771
H  -5.703255 -3.196338 -0.7377
H  -3.431996 -4.161091 -1.124897
H  1.371537 -1.542175 1.041281
H  6.408481 -1.816574 0.45693
H  2.603592 -3.630437 1.61744
H  5.082203 -3.773136 1.307558
