program: Gaussian 09
title: 000269954
version: EM64L-G09RevD.01
frameworkgroup: C1[X(C16H17NO3)]
method: RPBEPBE
basis: SDD
operation: Freq
keyword: #p
keyword: freq=noraman
keyword: PBEPBE/SDD
title: #p freq=noraman PBEPBE/SDD
converged: YES YES NO NO
title: Mulliken charges:
elementType: O O O N C C C C C C C C C C C C C C C C H H H H H H H H H H H H H H H H H
charge: -0.265909 -0.232722 -0.245126 0.092656 0.155811 -0.492730 -0.425662 0.161551 -0.409788 -0.502399 0.007072 -0.040904 0.389116 0.159433 0.464397 -0.678737 -0.836095 -0.827600 -0.285439 -0.213105 0.225085 0.227783 0.214517 0.212716 0.218555 0.215678 0.235865 0.241448 0.224025 0.232303 0.233169 0.238125 0.267731 0.243034 0.243702 0.285237 0.267209
chargesum: 0.00000
title: Mulliken charges with hydrogens summed into heavy atoms:
elementType: O O O N C C C C C C C C C C C C C C C C
charge: -0.265909 -0.232722 -0.245126 0.092656 0.155811 -0.039862 0.001570 0.161551 0.024444 -0.025087 0.007072 -0.040904 0.389116 0.159433 0.464397 -0.454712 -0.132499 -0.073133 -0.000202 0.054104
polarizability: 4.28246337e+02 -1.48157315e+01 1.99443392e+02 5.25956423e-01 -9.00520700e-01 9.86800551e+01
1716.lowfreq: -3.2313 -0.0004 -0.0004 0.0006 3.9736 9.9570 30.2664 42.4376 70.6446
frequency: 30.1998 42.4348 70.6438 85.8262 100.5595 118.0902 144.5262 149.4745 158.1200 162.6987 180.9058 208.2038 246.9396 258.7641 274.4036 279.4613 310.6396 321.2392 330.1472 415.1009 417.0243 454.0008 460.3468 505.8731 554.2200 572.3785 587.7299 604.3273 613.0600 633.8195 650.9246 682.9265 689.1849 718.7277 775.6167 780.5700 822.0831 843.5205 850.9035 883.5495 892.4271 905.9021 926.3747 942.1862 963.5863 998.2144 1002.8585 1033.0339 1038.3897 1045.6307 1067.9963 1077.3128 1084.7630 1099.0441 1129.2231 1137.9074 1170.9278 1205.3131 1209.2425 1224.0350 1232.1967 1239.2595 1261.1356 1286.3364 1303.0322 1314.2458 1330.8590 1340.5612 1349.9823 1366.5355 1380.1001 1394.5260 1402.3475 1405.0806 1425.7558 1454.8021 1461.0273 1468.9910 1470.8481 1471.7634 1475.9950 1483.0624 1483.5885 1501.3962 1564.0067 1600.1887 1622.2282 1639.5472 2967.4739 2970.9043 2977.8977 2984.4606 2989.2863 2990.3555 3030.4748 3033.3794 3050.3670 3055.6307 3059.6869 3065.2536 3087.5576 3109.7713 3135.0011 3136.4355 3204.2316
redmass: 6.2850 7.3554 7.0851 3.5690 2.8325 2.9915 1.0463 1.2475 2.3864 4.0718 2.5010 6.6220 3.1748 3.8829 3.1777 2.8529 2.2986 3.1338 3.7616 3.9692 4.6138 3.7523 3.3540 5.5909 3.6971 4.3285 4.0814 4.4050 4.8588 4.6794 5.2362 4.3304 5.5850 5.2955 4.5287 3.9847 1.5676 1.7401 2.4121 1.4769 2.8343 1.5146 2.5883 5.6180 2.3164 3.4428 1.2331 1.7015 1.5233 1.5461 2.4678 1.8551 2.5572 2.9963 1.4711 1.4424 2.2797 2.5532 5.3802 1.9844 1.3224 1.6604 1.4000 1.9261 1.4666 2.2237 1.4539 1.4510 1.6892 3.3000 5.2704 2.5756 1.2067 1.6436 4.1124 1.1286 1.0976 1.0889 1.0703 1.0970 1.0995 1.0751 1.2263 3.6551 7.3462 6.5883 6.1668 7.2141 1.0649 1.0637 1.0391 1.0638 1.0387 1.0625 1.0945 1.0942 1.0990 1.0968 1.1037 1.0977 1.0988 1.0978 1.0879 1.0906 1.0944
irintensity: 0.1690 0.2607 1.6002 1.6047 0.7722 0.0709 1.3329 2.0201 5.6056 1.9708 0.4918 0.2139 0.5450 1.1420 0.2659 1.6231 0.8846 0.3654 0.2644 1.2901 0.8092 0.9017 0.8705 0.3528 4.7652 7.2351 1.5804 3.0473 0.2020 2.6615 10.8080 4.9427 1.9364 3.9839 0.2433 3.0891 10.3116 30.1859 4.9703 10.3994 8.1211 1.2393 2.9069 26.8715 8.1685 3.0041 38.5137 12.9416 0.3561 8.8601 4.1953 0.7074 1.8375 18.8302 16.4773 6.2949 1.7940 48.9336 871.6718 186.4295 2.0908 3.4884 0.4675 12.2471 35.3749 22.7562 4.2499 4.0065 7.0213 46.0181 87.2807 6.6680 14.4668 26.2786 33.3926 4.2831 20.6766 15.8221 6.0162 8.0052 6.3659 18.3919 31.8058 24.7865 96.8486 464.6105 86.6996 6.6578 18.0769 28.1001 37.5744 34.1408 13.0858 32.7477 32.6723 14.6870 76.7129 16.2797 58.2658 12.2553 15.1642 5.5179 0.5388 8.9610 11.1095
temp: 298.150 k
press: 1.00000 atm
elementType: 8 8 8 7 6 6 6 6 6 6 6 6 6 6 6 6 6 6 6 6 1 1 1 1 1 1 1 1 1 1 1 1 1 1 1 1 1
symmnumber: 1
zpe: 775904.5 jmol-1
zpe.correction: 0.295526 hartree
zpe.thermalcorrener: 0.313869 hartree
zpe.thermalcorrenthalpy: 0.314813 hartree
zpe.thermalcorrgfe: 0.248765 hartree
zpe.sumelectzpe: -898.797017 hartree
zpe.sumelectthermal: -898.778674 hartree
zpe.sumelectthermalent: -898.777730 hartree
zpe.sumelectthermalfe: -898.843778 hartree
dipole: 10.3910 1.2544 -0.0137
dipole: 10.4665
quadrupole: -154.5003 -109.8297 -118.1487
quadrupole: -0.3492 -0.1212 -0.0563
quadrupole: -27.0074 17.6632 9.3442 -0.3492 -0.1212 -0.0563
hfenergy: -899.0925432 hartree
pointgroup: C01 [X(C16H17N1O3)]
dipole: 4.1008996 -0.3571073 -0.1079483 debye
polarizability: 426.8905306|22.479664|200.3889213|-6.3427339|5.0130879|99.0903323 unknown
InChI: InChI=1S/C16H17NO3/c1-10-9-12(7-8-17(18)19)11(2)16-15(10)13-5-3-4-6-14(13)20-16/h7-9H,3-6H2,1-2H3
charge 0 multiplicity 1
37 atoms
O  1.693556 1.757839 0.062404
O  -6.307863 -1.252689 0.099943
O  -5.733157 0.964814 0.188375
N  -5.427646 -0.295207 0.123885
C  2.647521 -0.353506 -0.060168
C  3.783265 -1.352247 -0.129846
C  5.109692 -0.636729 -0.507626
C  2.893185 1.009079 0.00379
C  5.323719 0.666258 0.305749
C  4.210008 1.713398 0.019284
C  1.20194 -0.51611 -0.036919
C  0.649408 0.799151 0.036258
C  0.306054 -1.630796 -0.071493
C  -0.712402 1.122486 0.080748
C  -1.600763 -0.006169 0.048043
C  -1.066546 -1.340107 -0.025416
C  0.805167 -3.060036 -0.163132
C  -1.168677 2.566578 0.160228
C  -3.037009 0.235503 0.092355
C  -4.034177 -0.701738 0.072954
H  3.900189 -1.860149 0.849539
H  3.56408 -2.147197 -0.866568
H  5.959603 -1.325116 -0.343629
H  5.096784 -0.389767 -1.58804
H  6.309829 1.105239 0.067885
H  5.327388 0.424507 1.386733
H  4.389148 2.210912 -0.955781
H  4.214768 2.513166 0.783983
H  -1.768276 -2.18124 -0.048228
H  1.300498 -3.252934 -1.133786
H  1.542207 -3.286265 0.628963
H  -0.026413 -3.778143 -0.065865
H  -0.300918 3.243893 0.160125
H  -1.811463 2.838325 -0.696886
H  -1.749109 2.759209 1.081125
H  -3.380446 1.276007 0.147661
H  -3.923145 -1.78492 0.022351
