program: Gaussian 09
title: 000269948
version: EM64L-G09RevD.01
frameworkgroup: C1[X(C7H8N2O2)]
method: RPBEPBE
basis: SDD
operation: Freq
keyword: #pfreq=noraman
keyword: PBEPBE/SDD
title: #p freq=noraman PBEPBE/SDD
converged: YES YES NO NO
title: Mulliken charges:
elementType: O O N N C C C C C C C H H H H H H H H
charge: -0.348221 -0.376777 -0.700112 -0.340374 0.364153 -0.550915 0.512656 -0.418728 -0.413952 -0.195925 0.199058 0.267011 0.219746 0.221696 0.223916 0.314906 0.308217 0.335552 0.378091
chargesum: 0.00000
title: Mulliken charges with hydrogens summed into heavy atoms:
elementType: O O N N C C C C C C C
charge: -0.348221 0.001314 -0.076988 -0.004823 0.364153 -0.283903 0.512656 -0.198981 -0.192255 0.027991 0.199058
polarizability: 1.53983748e+02 5.60450096e+00 1.10065149e+02 4.85472925e-01 -5.45932307e-01 4.13530867e+01
1716.lowfreq: -5.2992 -0.0006 0.0002 0.0004 10.2678 11.3776 42.5144 111.7473 134.3253
frequency: 42.4898 111.7226 134.3204 208.6128 218.0426 272.4856 325.1151 362.9845 378.4113 382.7585 401.5609 439.5409 476.2361 523.3911 536.6213 576.5662 667.6235 687.8375 711.3540 786.7718 819.9658 866.5786 906.7829 923.3888 963.8692 980.6631 995.9284 1039.3368 1102.0764 1120.6759 1183.6302 1228.2828 1298.5939 1326.5347 1364.1053 1402.5163 1452.4675 1486.2213 1492.3670 1553.7549 1595.9263 1628.9371 1645.9651 3121.8284 3134.6300 3142.2105 3157.9318 3181.3479 3567.2375 3624.6305 3707.6074
redmass: 6.3115 5.4210 5.4521 4.5789 4.3825 5.6379 3.9379 1.6738 3.6157 1.1326 1.1257 2.4226 3.8581 1.5638 3.4889 2.8855 7.0235 2.0381 2.9928 1.7384 6.8624 1.4899 1.5850 4.0707 1.3495 5.8091 3.2506 1.7392 1.8197 1.6398 1.0856 1.4976 1.4685 1.8606 2.4810 7.7928 3.0195 3.3266 2.6606 2.7901 5.7223 3.6209 1.3477 1.0864 1.0910 1.0917 1.0993 1.0627 1.0450 1.0823 1.1041
irintensity: 6.8488 0.3161 1.2735 5.4401 11.6270 23.6228 26.9548 77.3992 6.9444 174.2471 145.4236 31.1422 6.7016 104.6004 28.7943 27.7131 1.9757 11.3419 66.5476 35.9251 23.3920 6.3163 31.9776 36.0549 1.5984 18.5167 70.3008 5.7430 8.8463 25.7559 4.9478 16.6254 17.9582 18.0048 274.0269 13.1335 61.6300 21.8730 136.6470 57.9996 3.7601 54.5879 262.7670 5.6835 21.4825 6.1220 19.6605 31.3764 74.9269 58.8598 23.0088
temp: 298.150 k
press: 1.00000 atm
elementType: 8 8 7 7 6 6 6 6 6 6 6 1 1 1 1 1 1 1 1
symmnumber: 1
zpe: 378381.4 jmol-1
zpe.correction: 0.144118 hartree
zpe.thermalcorrener: 0.154486 hartree
zpe.thermalcorrenthalpy: 0.155430 hartree
zpe.thermalcorrgfe: 0.108199 hartree
zpe.sumelectzpe: -530.657979 hartree
zpe.sumelectthermal: -530.647611 hartree
zpe.sumelectthermalent: -530.646667 hartree
zpe.sumelectthermalfe: -530.693898 hartree
dipole: -4.4216 1.3029 -0.9568
dipole: 4.7079
quadrupole: -56.1645 -56.2267 -69.1077
quadrupole: 7.7151 -0.5372 0.8011
quadrupole: 4.3352 4.2729 -8.6081 7.7151 -0.5372 0.8011
hfenergy: -530.802097 hartree
pointgroup: C01 [X(C7H8N2O2)]
dipole: -1.7534928 -0.4347502 0.408586 debye
dipolederiv: -0.7265741 -0.2397417 0.042934 -0.0474939 -0.90346 0.1475778 -0.0168967 0.1102979 -0.4138533 -0.8882897 0.1075313 -0.0280607 -0.1755461 -0.1476254 -0.0378291 0.0154029 -0.0218696 -0.3484631 -0.8325776 0.6896991 0.0450633 0.7794119 -0.8079497 -0.0496062 0.0658924 -0.058126 -0.758568 0.048702 0.1534364 -0.0304529 0.5344174 -0.5221208 0.0033176 -0.0458965 -0.0657802 -0.3185726 -0.1923324 -0.2096833 0.0107663 -0.0982508 0.2568054 0.0435255 0.0655837 0.0454012 0.0416886 -0.3395325 0.4833769 0.02868 -0.1055174 -0.0838202 0.016208 0.0093854 -0.0381648 -0.2091855 0.8390167 -0.8675062 -0.086613 -0.9474058 0.7713004 0.0852838 -0.1019022 0.0878701 0.1647889 -0.2701235 -0.0587976 -0.0335141 0.0240305 -0.2287174 0.0149967 -0.0735044 0.0296785 -0.2295971 -0.0309621 -0.0273161 -0.0194085 0.4271631 -0.2928227 -0.0257584 0.0149023 0.0000097 -0.233766 0.2228058 0.0561487 -0.0112529 -0.0638753 0.1754757 0.0250262 -0.0178199 0.0196959 -0.1054968 1.1431269 -0.0262788 0.039424 -0.1032556 1.0900652 -0.2470607 0.0640407 -0.1870767 0.2530645 0.121376 -0.022654 0.0022845 -0.0073321 -0.0316054 -0.0152983 -0.0131559 -0.0035984 0.1703565 -0.0229263 0.1130497 0.0268777 0.0899689 0.0027103 -0.0253349 0.0390408 -0.0255873 0.1644715 -0.142448 -0.0377809 0.0155416 -0.0149453 0.0751739 -0.0065733 0.0143103 -0.0028421 0.1694528 0.0590793 -0.0624217 0.0020435 -0.0757767 -0.1057965 -0.0166941 0.0006865 -0.0184616 0.1493217 0.1452609 -0.0372385 0.0127899 -0.0663959 0.1969405 -0.0058446 0.0064006 -0.0009347 0.3903988 0.1897504 -0.0552409 0.0069853 -0.0428479 0.1453991 -0.0114857 0.0024608 -0.008028 0.3907422 0.2173769 -0.0479559 -0.0022998 -0.1064279 0.226418 0.0597919 -0.0072776 0.0826456 0.3571043 0.4592714 0.0893737 -0.0217882 0.0000787 0.1836296 0.0457579 -0.0216532 0.0548704 0.3661126 unknown
polarizability: 153.3301471|-7.5612896|110.6607644|-2.6512357|-0.197364|41.4110729 unknown
InChI: InChI=1S/C7H8N2O2/c8-6-3-1-2-5(4-6)7(10)9-11/h1-4,9,11H,8H2
charge 0 multiplicity 1
19 atoms
O  2.0521 1.418747 -0.394446
O  3.970958 -0.284471 0.1210
N  -3.085459 1.538978 0.214096
N  2.603322 -0.722362 0.135757
C  0.211785 -0.192258 -0.077577
C  -0.750771 0.834243 0.035861
C  -2.137406 0.524344 0.099147
C  -0.19093 -1.553556 -0.151505
C  -2.535027 -0.844831 0.042155
C  -1.56735 -1.860478 -0.087211
C  1.641886 0.227551 -0.126886
H  -0.399843 1.872056 0.068408
H  0.537154 -2.357433 -0.304485
H  -3.599771 -1.104127 0.088437
H  -1.893836 -2.9045 -0.150567
H  -2.80204 2.513938 0.242928
H  -4.077623 1.325092 0.248919
H  2.499484 -1.654809 0.528838
H  3.839567 0.691374 -0.134568
