program: Gaussian 09
title: 000269946
version: EM64L-G09RevD.01
frameworkgroup: C1[X(C7H7NO3)]
method: RPBEPBE
basis: SDD
operation: Freq
keyword: #pfreq=noraman
keyword: PBEPBE/SDD
title: #p freq=noraman PBEPBE/SDD
converged: YES YES NO NO
title: Mulliken charges:
elementType: O O O N C C C C C C C H H H H H H H
charge: -0.422448 -0.346623 -0.375911 -0.343072 0.313852 -0.330616 -0.329822 -0.376515 -0.346619 0.294125 0.207504 0.277497 0.221578 0.228100 0.257404 0.331922 0.360395 0.379248
chargesum: 0.00000
title: Mulliken charges with hydrogens summed into heavy atoms:
elementType: O O O N C C C C C C C
charge: -0.062053 -0.346623 0.003337 -0.011150 0.313852 -0.053120 -0.108244 -0.148415 -0.089215 0.294125 0.207504
polarizability: 1.59079938e+02 3.85924605e+00 9.72487330e+01 -9.01326792e-01 -7.72863651e-01 3.82328850e+01
1716.lowfreq: -7.0369 -0.0006 -0.0004 -0.0003 7.2020 9.4029 42.6336 87.3904 134.7114
frequency: 42.6225 87.3815 134.7082 178.7034 271.6870 299.3709 315.6636 360.6122 382.1955 389.7193 411.9893 468.4808 507.2816 531.4000 602.1519 631.8471 676.5558 739.0563 799.7290 817.6012 834.2098 870.7653 949.3697 970.5182 980.6361 1004.5891 1104.0272 1119.6914 1146.7719 1179.4708 1248.9891 1257.6218 1311.6407 1363.8559 1390.9502 1426.0516 1479.5578 1503.4370 1554.9584 1597.4596 1626.1005 3122.2148 3129.1744 3166.5187 3176.0995 3184.2190 3579.9942 3622.9054
redmass: 4.8389 6.7103 6.4888 8.3002 3.6146 4.9541 6.4010 1.8570 3.0412 1.2239 2.7697 4.2853 2.3425 1.2456 7.0712 6.8743 3.5160 4.1640 6.3256 1.2558 1.7278 6.4163 1.3783 1.3550 6.9981 2.7922 1.4115 2.7904 1.3359 1.1276 1.5317 2.5365 1.3443 2.3912 4.2253 4.0349 2.4175 2.9815 2.7628 5.8799 6.3868 1.0902 1.0898 1.0946 1.0954 1.0627 1.0661 1.0821
irintensity: 8.8238 1.1955 1.0499 8.9233 54.6086 28.9689 8.7677 40.2915 5.5487 177.1147 1.7609 25.8422 102.2982 69.4749 18.9439 0.9348 43.7132 12.5592 16.9490 0.9342 69.8612 6.4444 2.6948 1.4374 131.0770 4.6278 58.4489 70.4332 195.6690 16.0304 34.1182 10.9543 3.6381 347.8882 20.2889 10.9926 83.8665 61.7245 16.8291 45.7188 107.0163 17.3635 9.5652 2.2079 4.3436 32.2474 59.6518 59.8538
temp: 298.150 k
press: 1.00000 atm
elementType: 8 8 8 7 6 6 6 6 6 6 6 1 1 1 1 1 1 1
symmnumber: 1
zpe: 344228.8 jmol-1
zpe.correction: 0.131110 hartree
zpe.thermalcorrener: 0.141192 hartree
zpe.thermalcorrenthalpy: 0.142136 hartree
zpe.thermalcorrgfe: 0.095230 hartree
zpe.sumelectzpe: -550.521551 hartree
zpe.sumelectthermal: -550.511469 hartree
zpe.sumelectthermalent: -550.510525 hartree
zpe.sumelectthermalfe: -550.557431 hartree
dipole: 3.4967 -0.7284 -0.8790
dipole: 3.6784
quadrupole: -64.9562 -58.1233 -67.0426
quadrupole: 10.8363 0.3561 -0.8468
quadrupole: -1.5822 5.2508 -3.6686 10.8363 0.3561 -0.8468
hfenergy: -550.652661 hartree
pointgroup: C01 [X(C7H7N1O3)]
dipole: 1.3794025 -0.2338278 -0.3700044 debye
dipolederiv: -1.6911568 -0.0101079 0.0531747 0.0248828 -0.0707202 -0.0398882 0.0580402 -0.0404448 -0.4214979 -0.8270511 0.2887028 0.043113 0.118644 -0.8660783 -0.0914487 -0.0028615 -0.0775833 -0.3968678 -0.8790814 -0.2419101 -0.0068383 0.0344384 -0.1594549 0.0132782 0.0040039 0.0096349 -0.3550185 0.1319815 -0.0223132 -0.0311121 -0.4816157 -0.6360328 0.0327718 0.0003712 0.0951365 -0.3245163 -0.5299198 0.0196598 0.028257 0.0951553 -0.1697329 -0.0016775 0.0508697 -0.0009175 -0.0230868 0.229937 0.0556026 -0.0219804 0.0827993 0.08386 -0.0301125 -0.0051976 -0.0081471 -0.0879149 0.2499882 -0.0683805 -0.0241109 -0.1248186 0.1019824 -0.0418993 -0.0627653 -0.0397947 -0.127126 -0.4135161 0.0365588 0.0025288 0.4037634 0.0011881 -0.0395161 -0.038496 -0.0266345 -0.1996726 -0.4269533 -0.0082522 0.01314 -0.3711986 0.0177785 -0.0090598 0.0631817 -0.0280396 -0.1628606 1.6079454 0.0207134 -0.0715901 0.005144 0.1161227 -0.0065485 -0.0774845 -0.0029483 0.0979981 1.3135633 0.0094923 -0.0183161 0.1265423 1.1379086 0.1602256 0.0065612 0.1222933 0.230425 0.109727 0.0675459 -0.0061347 0.0435399 0.0279944 0.0176648 -0.0149824 0.0056579 0.1549141 0.0302807 -0.1089918 0.021303 -0.0867947 -0.0336911 0.0322012 0.0248714 0.0279532 0.1413399 -0.0316647 -0.1030995 0.0207652 -0.0948267 -0.0238254 0.0281502 0.0197912 0.0290356 0.170098 0.0450686 0.0653079 -0.002405 0.0718604 -0.0056253 0.0225412 0.0011506 0.0239427 0.1703728 0.1691434 0.0282529 0.0111886 0.1104258 0.2424667 -0.0538703 -0.0052766 -0.0852355 0.3697894 0.436573 0.0119454 -0.0018136 -0.010381 0.067005 0.0385638 -0.0027419 0.0362663 0.3873653 0.475135 -0.0407265 -0.0091692 0.0524398 0.1688543 -0.031376 -0.0190351 -0.0401751 0.3762587 unknown
polarizability: 158.5110352|6.5210741|97.6335919|-3.6531354|-2.4936643|38.4169293 unknown
InChI: InChI=1S/C7H7NO3/c9-6-3-1-5(2-4-6)7(10)8-11/h1-4,8-9,11H
charge 0 multiplicity 1
18 atoms
O  3.916191 -0.190434 -0.116941
O  -2.42173 1.239362 0.282966
O  -3.97102 -0.843452 -0.027828
N  -2.543577 -1.008374 -0.041933
C  -0.304826 0.013098 0.054913
C  0.443513 1.205508 -0.115007
C  0.387928 -1.222459 0.185197
C  1.848544 1.170601 -0.177777
C  1.791181 -1.269772 0.124092
C  2.521935 -0.071613 -0.063686
C  -1.785583 0.133395 0.105571
H  -0.101185 2.151665 -0.192127
H  -0.156214 -2.155838 0.371091
H  2.415858 2.100345 -0.312485
H  2.338099 -2.210642 0.231042
H  -2.270669 -1.931682 -0.370362
H  4.347356 0.691977 -0.238473
H  -4.031504 0.158314 0.137146
