program: Gaussian 09
title: 000269945
version: EM64L-G09RevD.01
frameworkgroup: C1[X(C9H14O5)]
method: RPBEPBE
basis: SDD
operation: Freq
keyword: #pfreq=noraman
keyword: PBEPBE/SDD
title: #p freq=noraman PBEPBE/SDD
converged: YES YES NO NO
title: Mulliken charges:
elementType: O O O O O C C C C C C C C C H H H H H H H H H H H H H H
charge: -0.196487 -0.418628 -0.418616 -0.226470 -0.226498 -0.511091 -0.511052 -0.369776 -0.369806 0.206522 -0.475499 -0.475602 0.176694 0.176733 0.231740 0.231051 0.231687 0.231020 0.248778 0.237043 0.248963 0.236950 0.249400 0.244293 0.249445 0.244330 0.377437 0.377439
chargesum: 0.00000
title: Mulliken charges with hydrogens summed into heavy atoms:
elementType: O O O O O C C C C C C C C C
charge: -0.196487 -0.041191 -0.041177 -0.226470 -0.226498 -0.048299 -0.048346 0.116046 0.116107 0.206522 0.018194 0.018173 0.176694 0.176733
polarizability: 1.48809616e+02 -2.94446834e-03 1.00536374e+02 -3.80258892e+00 8.86160249e-03 8.38086170e+01
1716.lowfreq: -5.9402 0.0009 0.0009 0.0010 2.9823 6.0652 12.5565 14.9664 21.2152
frequency: 12.1004 14.9663 20.8529 36.0467 59.6299 67.7910 72.9654 86.9068 110.8236 125.0228 169.0697 209.3044 254.8179 302.5939 396.9120 437.3250 457.7652 471.2013 507.6776 510.3124 587.9464 596.0672 646.1876 647.1315 671.2832 705.6479 742.0856 790.6457 836.1513 854.7636 865.7500 895.8184 994.5560 995.9280 1036.0716 1039.8762 1068.5005 1078.8503 1087.9351 1091.2281 1113.9832 1130.5159 1167.4673 1233.6337 1239.0727 1242.1125 1257.2911 1272.7304 1281.6761 1283.9869 1289.8980 1339.6721 1355.7529 1376.5935 1376.6085 1430.1439 1432.3145 1440.6329 1441.0285 1476.7348 1476.8194 1636.3285 1671.5974 1671.9253 2945.7964 2950.6160 2980.8105 2980.8829 3001.0031 3004.7306 3022.3178 3022.6037 3042.5677 3042.6125 3085.6163 3085.8793 3510.6533 3510.7017
redmass: 11.1289 10.6656 4.6414 5.3176 2.8817 2.2269 2.3379 3.1861 4.1575 2.3204 5.8163 5.4498 6.6157 5.5899 3.9686 4.2926 2.1076 3.3276 2.0092 2.0736 4.0121 3.7797 1.3601 1.3573 3.6894 1.1901 1.3403 1.8390 3.1697 1.6063 4.8801 3.7329 3.8099 1.7489 2.4593 2.5466 2.1970 2.0642 3.1284 2.1115 2.3973 1.3594 1.3647 1.3569 1.4441 1.2973 1.2619 1.4759 1.0965 1.2782 1.3343 1.6619 1.9397 1.8228 1.8281 1.0853 1.1080 1.0779 1.0810 1.0851 1.0853 8.2132 8.3618 8.3938 1.0618 1.0641 1.0641 1.0641 1.0938 1.0954 1.0616 1.0616 1.0948 1.0948 1.1028 1.1028 1.0639 1.0639
irintensity: 0.3904 1.1741 0.8756 0.0056 0.2485 0.5839 0.0002 0.1367 0.2752 0.0002 0.0243 0.2030 17.1188 7.3166 2.3081 68.8111 1.7893 0.0968 45.2514 19.3141 28.2542 13.0033 147.2259 100.7912 0.9929 5.0012 33.6741 4.3294 2.1869 1.7794 1.3578 1.8403 25.4012 8.6763 36.1190 488.4642 3.0971 2.0678 7.6092 103.7442 0.9171 0.0978 0.6649 1.5429 29.2367 0.2843 22.7649 2.5042 1.1030 82.7693 90.4723 2.1047 0.5104 65.8731 17.2674 6.0474 4.8482 12.5775 51.0249 8.2121 26.3314 69.5951 177.0648 261.9429 20.7285 13.0640 8.3003 14.8055 13.5143 16.2540 4.6401 11.7980 2.9612 5.1450 6.6259 43.6795 26.1493 15.0280
temp: 298.150 k
press: 1.00000 atm
elementType: 8 8 8 8 8 6 6 6 6 6 6 6 6 6 1 1 1 1 1 1 1 1 1 1 1 1 1 1
symmnumber: 1
zpe: 582472.6 jmol-1
zpe.correction: 0.221852 hartree
zpe.thermalcorrener: 0.238173 hartree
zpe.thermalcorrenthalpy: 0.239117 hartree
zpe.thermalcorrgfe: 0.172032 hartree
zpe.sumelectzpe: -726.394010 hartree
zpe.sumelectthermal: -726.377688 hartree
zpe.sumelectthermalent: -726.376744 hartree
zpe.sumelectthermalfe: -726.443830 hartree
dipole: 0.0025 -5.1434 -0.0032
dipole: 5.1434
quadrupole: -72.1003 -91.4827 -84.9716
quadrupole: 0.0263 -8.2953 0.0101
quadrupole: 10.7512 -8.6312 -2.1200 0.0263 -8.2953 0.0101
hfenergy: -726.6158616 hartree
pointgroup: C01 [X(C9H14O5)]
dipole: 0.0030431 -2.0235466 0.0115162 debye
polarizability: 148.9494075|0.0311817|100.5358276|-2.3134238|-0.0999014|83.6693721 unknown
InChI: InChI=1S/C9H14O5/c10-7(3-1-5-8(11)12)4-2-6-9(13)14/h11,13H,1-6H2
charge 0 multiplicity 1
28 atoms
O  -0.002119 1.367916 -0.011735
O  -6.234242 -0.597049 0.416048
O  6.234936 -0.586631 -0.402675
O  -5.234924 0.944726 -1.003275
O  5.229316 0.964424 1.002007
C  -1.291866 -0.702287 0.15358
C  1.292215 -0.701593 -0.14743
C  -2.573203 0.100218 -0.139057
C  2.5713 0.106365 0.14019
C  -0.000763 0.109627 -0.002755
C  -3.837301 -0.707733 0.211373
C  3.837892 -0.701486 -0.201315
C  -5.118268 -0.009998 -0.206014
C  5.116443 0.002698 0.212651
H  -1.226775 -1.608725 -0.482959
H  -1.303175 -1.07889 1.200837
H  1.227271 -1.601702 0.497977
H  1.306906 -1.088468 -1.190902
H  -2.551017 1.045045 0.431839
H  -2.601577 0.394561 -1.20353
H  2.547682 1.046154 -0.43892
H  2.597413 0.409909 1.202145
H  -3.89759 -0.925621 1.293984
H  -3.827859 -1.695004 -0.295431
H  3.90063 -0.928063 -1.282004
H  3.829873 -1.684594 0.313527
H  -7.060286 -0.136332 0.103729
H  7.059289 -0.121266 -0.092784
