program: Gaussian 09
title: 000269936
version: EM64L-G09RevD.01
frameworkgroup: C1[X(C11H7BrO3)]
method: RPBEPBE
basis: SDD
operation: Freq
keyword: #p
keyword: freq=noraman
keyword: PBEPBE/SDD
title: #p freq=noraman PBEPBE/SDD
converged: NO YES NO NO
title: Mulliken charges:
elementType: Br O O O C C C C C C C C C C C H H H H H H H
charge: 0.048406 -0.251006 -0.186824 -0.225614 0.467511 0.184197 -0.283514 0.066208 -0.379253 -0.353369 0.086197 -0.226482 0.150245 -0.192822 -0.748047 0.308161 0.275899 0.259734 0.247993 0.252988 0.246099 0.253290
chargesum: 0.00000
title: Mulliken charges with hydrogens summed into heavy atoms:
elementType: Br O O O C C C C C C C C C C C
charge: 0.048406 -0.251006 -0.186824 -0.225614 0.467511 0.184197 0.024647 0.066208 -0.379253 -0.077470 0.086197 0.033253 0.150245 0.055172 0.004331
polarizability: 2.29840306e+02 1.37680292e+01 1.76522965e+02 -1.21237395e-02 1.98962137e-02 5.71552979e+01
1716.lowfreq: -7.9783 -4.2046 -0.0009 -0.0008 -0.0008 1.5148 33.8161 40.4896 101.8270
frequency: 33.7890 40.4684 101.8267 104.4498 139.8591 158.7414 203.4659 231.4932 274.1621 283.6189 325.7803 335.0159 377.1165 383.7178 448.7751 509.1872 533.1946 563.3475 568.5791 577.7083 616.3486 663.1104 725.6558 729.0476 746.2188 796.3466 823.8709 840.2996 901.6141 904.1217 975.7047 980.0731 987.2319 1032.8633 1057.8488 1068.2958 1136.9136 1188.0266 1211.1902 1243.9734 1279.5159 1337.6166 1380.6921 1388.5721 1423.2570 1427.3324 1441.6309 1444.2757 1537.6553 1557.7524 1593.7817 1616.6085 1686.8439 2997.8860 3079.2310 3131.6216 3141.1744 3154.7694 3179.3281 3189.0343
redmass: 4.0419 9.6163 7.2714 11.9895 4.9488 1.0798 8.0162 5.2248 7.1516 6.7367 6.1457 7.9286 5.1222 3.9809 9.6617 3.4733 6.2542 5.0609 6.3161 3.1388 6.3828 6.8771 4.5051 7.8342 3.3950 1.6253 4.9908 8.9859 1.3804 8.9525 2.0577 1.3445 1.4046 1.8043 1.9401 2.7106 2.1458 1.3973 3.2508 1.8037 3.3501 2.4415 1.2387 8.1426 2.5613 1.1253 1.0483 4.0150 6.3454 6.9194 7.6683 7.9626 12.4200 1.0368 1.0947 1.1022 1.0912 1.0884 1.0932 1.0987
irintensity: 7.2508 0.9712 0.1439 0.4263 0.6479 0.7102 4.5526 2.8903 10.5536 4.5616 0.9540 2.9755 0.9345 0.6455 0.4173 0.0100 22.4233 1.3309 29.5103 0.6613 7.6590 3.8361 24.3771 14.1072 1.1210 66.3861 6.9925 80.1974 0.8092 79.8726 19.0391 0.0336 21.1177 0.5368 1.0380 32.3390 5.6528 23.9825 190.6826 54.3705 66.1771 4.5956 74.4293 0.7495 119.4105 41.6492 20.4635 2.1393 177.6574 21.2726 104.4050 137.6596 552.3594 0.5667 4.8160 23.0637 2.6193 4.3870 1.0562 3.8697
temp: 298.150 k
press: 1.00000 atm
elementType: 35 8 8 8 6 6 6 6 6 6 6 6 6 6 6 1 1 1 1 1 1 1
symmnumber: 1
zpe: 393641.0 jmol-1
zpe.correction: 0.149930 hartree
zpe.thermalcorrener: 0.163099 hartree
zpe.thermalcorrenthalpy: 0.164044 hartree
zpe.thermalcorrgfe: 0.108284 hartree
zpe.sumelectzpe: -661.456900 hartree
zpe.sumelectthermal: -661.443731 hartree
zpe.sumelectthermalent: -661.442787 hartree
zpe.sumelectthermalfe: -661.498547 hartree
dipole: 3.6495 2.2635 0.0092
dipole: 4.2945
quadrupole: -92.8400 -99.3595 -95.9386
quadrupole: 10.5538 -0.0191 -0.0264
quadrupole: 3.2060 -3.3135 0.1075 10.5538 -0.0191 -0.0264
hfenergy: -661.6068302 hartree
pointgroup: C01[X(C11H7Br1O3)]
dipole: 1.6073973 -0.5105309 -0.1016225 debye
dipolederiv: -0.0356215 -0.0294895 0.0229252 -0.1918574 -0.4864666 0.2864196 0.1041333 0.2507024 -0.1472186 -1.2856039 -0.2310729 0.3533629 0.1856759 -0.3496701 0.032587 0.1448118 0.1240261 -0.2975903 -1.1191957 -0.2622179 0.310827 -0.4784612 -0.5835781 0.2459765 0.4181796 0.1978217 -0.494192 -0.6772964 0.0812071 0.0403981 0.4185085 -0.807913 0.1577884 -0.1280656 0.2321219 -0.3933922 -0.7044016 0.1167433 0.1010347 0.2287724 -0.4414655 0.1814157 0.0448628 0.2058785 -0.0920513 0.6714196 0.2243681 -0.2263858 -0.0671724 0.286706 -0.051492 -0.0798336 -0.1157864 0.230073 0.9976952 -0.0691518 -0.1830995 -0.100473 0.0795148 -0.0142955 -0.1661038 -0.021151 0.0548641 -1.2836275 0.2036988 0.1671207 -0.281555 -0.3488013 0.2074526 0.4092568 0.1011929 -0.1983821 0.4844422 -0.1262472 -0.069357 0.3986865 0.9548917 -0.6251522 -0.332422 -0.5094292 0.2098714 -0.3824591 -0.1518272 0.1217926 0.0128745 0.0153229 -0.0980944 0.0393349 -0.0616049 -0.1523883 1.7361424 0.3473337 -0.4934591 0.4302488 0.7948729 -0.3529302 -0.5352768 -0.3339783 0.5650488 -0.1613585 0.1544842 -0.0645996 0.2593633 -0.5259618 0.1549579 -0.1172808 0.1779395 -0.1661381 1.7008102 -0.3194444 -0.1823153 -0.6367731 0.8508987 -0.2165107 -0.0235294 -0.2868395 0.2818101 0.0687039 0.1082344 -0.0932623 -0.1162085 0.2304616 -0.1442272 0.019111 -0.1935344 -0.0155989 -0.4430132 -0.1229832 0.1606474 -0.2182721 -0.0541263 0.0814887 0.2083013 0.0611123 -0.0617034 0.1685758 -0.0119792 -0.0020285 -0.0129036 0.0785293 0.0300281 -0.0016623 0.0296995 0.117785 0.1004727 -0.0167292 0.0259642 0.0130718 0.0287743 0.0730859 0.0110586 0.0796402 0.137994 -0.0017993 -0.0316846 0.0530887 -0.0426186 0.0931924 0.0464563 0.0585813 0.0439321 0.1322528 -0.027908 0.0827975 -0.0003825 0.0723626 0.0425959 0.0423141 0.004901 0.0399483 0.1377387 0.1244636 -0.0063963 0.0132529 -0.0264007 0.0033509 -0.0871566 0.0033878 -0.0791853 0.0764838 -0.0372161 0.0687119 0.0004828 0.1622232 0.0039266 0.0230047 -0.0459328 0.043556 0.1099715 0.1067753 -0.0083555 -0.0560075 -0.009092 0.1349449 0.0268834 -0.0358129 0.0139376 -0.0352382 unknown
polarizability: 226.3542249|-11.150532|150.8202295|-31.587238|-44.4427213|86.3441142 unknown
InChI: InChI=1S/C11H7BrO3/c1-6(13)7-5-8-9(12)3-2-4-10(8)15-11(7)14/h2-5H,1H3
charge 0 multiplicity 1
22 atoms
Br 2.544869 2.693872 -1.648059
O  -0.016047 -1.306906 0.920252
O  -2.265724 -1.207264 1.362944
O  -2.403386 2.679496 -0.548794
C  1.170345 0.495547 -0.244787
C  1.161729 -0.785485 0.399472
C  -0.076615 1.203604 -0.325766
C  -1.266447 0.703132 0.187157
C  2.425338 0.95759 -0.752344
C  2.32664 -1.568605 0.535678
C  -1.305439 -0.60617 0.852582
C  3.594542 0.195404 -0.627726
C  -2.509715 1.558757 0.031952
C  3.535299 -1.069714 0.019461
C  -3.842929 1.07508 0.562752
H  -0.124278 2.186831 -0.808858
H  2.263811 -2.538269 1.035566
H  4.54241 0.568065 -1.023296
H  4.451181 -1.661586 0.114354
H  -4.126694 0.110868 0.103981
H  -4.606496 1.838312 0.350171
H  -3.790193 0.877142 1.648408
