program: Gaussian 09
title: 000269933
version: EM64L-G09RevD.01
frameworkgroup: C1[X(C16H20O)]
method: RPBEPBE
basis: SDD
operation: Freq
keyword: #pfreq=noraman
keyword: PBEPBE/SDD
title: #p freq=noraman PBEPBE/SDD
converged: NO YES NO NO
title: Mulliken charges:
elementType: O C C C C C C C C C C C C C C C C H H H H H H H H H H H H H H H H H H H H
charge: -0.436647 0.267664 -0.110322 -0.094368 -0.094366 -0.549174 -0.527325 -0.527326 -0.453998 -0.454000 -0.451662 0.450740 -0.400551 -0.365027 -0.381041 -0.433105 0.284741 0.194835 0.195959 0.195960 0.201149 0.201146 0.202696 0.214479 0.214479 0.202698 0.195273 0.194779 0.194779 0.195273 0.197056 0.188995 0.251175 0.223283 0.245688 0.214804 0.351263
chargesum: 0.00000
title: Mulliken charges with hydrogens summed into heavy atoms:
elementType: O C C C C C C C C C C C C C C C C
charge: -0.085385 0.267664 0.084513 0.101591 0.101593 -0.146878 -0.110150 -0.110148 -0.063947 -0.063948 -0.065612 0.450740 -0.149377 -0.141744 -0.135353 -0.218302 0.284741
polarizability: 2.18539422e+02 1.65693264e+00 1.54805232e+02 5.21901060e-03 1.06484951e-03 1.17490343e+02
1716.lowfreq: -27.5177 -3.9211 -0.0008 -0.0005 -0.0003 11.0765 39.2527 68.4984 119.2653
frequency: 39.0839 68.4871 119.2229 185.1502 242.1041 258.7772 297.1940 301.7931 345.2422 358.0807 385.4521 387.8603 405.7675 410.6482 412.2889 434.0768 439.9159 445.9919 535.4506 560.0291 629.8071 637.7657 643.3452 677.7896 726.9191 762.1594 795.4587 799.5689 808.2484 813.0001 832.0487 853.0959 869.5857 870.6781 874.7433 923.7604 941.8005 944.0171 960.1154 969.6822 969.9179 976.6238 999.4281 1021.3200 1046.7596 1048.4637 1049.9539 1101.6569 1102.3987 1102.9522 1106.4746 1108.4744 1111.5915 1144.5907 1178.6517 1183.1114 1186.8614 1212.0470 1248.0611 1251.9185 1257.1957 1284.4581 1286.6655 1292.9059 1305.5169 1307.5959 1312.1617 1319.6797 1323.2815 1338.8625 1340.9270 1352.1087 1359.3288 1359.3456 1382.8375 1419.9183 1451.2397 1451.3820 1461.4382 1461.6386 1466.3329 1482.7168 1502.3225 1594.2797 1626.2398 2955.6223 2959.0306 2960.7564 2961.0112 2962.6601 2967.0735 2990.3656 2990.7054 3003.3401 3014.0174 3015.3649 3017.6790 3025.6754 3026.2217 3028.6943 3103.1829 3133.8626 3148.3279 3169.7168 3582.8112
redmass: 3.8170 4.4522 3.8852 4.2773 5.9412 2.9088 2.3429 2.0244 1.1152 2.8269 3.9429 4.3592 3.4661 3.2889 1.9910 1.8982 1.7732 2.8190 2.3484 5.2034 4.9575 3.7399 5.0239 4.1900 3.8082 4.2115 1.6862 5.0639 2.8728 1.7752 1.6397 3.9847 1.5675 1.5806 1.5829 1.4558 2.0869 1.7641 1.4432 2.2131 2.1642 2.2120 3.6056 3.9569 1.8133 1.8515 1.7295 1.4325 1.2762 1.5272 1.3689 1.0527 1.0170 1.3556 1.1837 1.2255 1.1426 3.2861 2.4409 1.5197 1.6277 1.7817 1.8298 1.8712 2.2208 1.4393 1.5470 1.5992 1.3126 1.4418 1.4740 1.4641 1.5779 1.5586 4.6787 3.2466 1.0817 1.0875 1.0908 1.0958 1.0931 1.0914 2.5583 6.2619 6.3698 1.0601 1.0640 1.0610 1.0618 1.0594 1.0611 1.0832 1.0828 1.0828 1.1030 1.1031 1.1032 1.1022 1.1021 1.1021 1.0877 1.0946 1.0871 1.0962 1.0660
irintensity: 0.4124 0.5978 0.4002 0.1333 0.0854 1.1923 0.0053 0.0509 142.1816 4.0161 0.0817 4.5409 0.0996 0.5522 1.7929 0.6992 1.0639 4.4877 31.4553 9.7349 0.5753 0.0019 0.1742 0.0197 0.0951 0.1012 35.2420 25.6385 3.1398 0.3955 29.9951 0.2579 0.0004 0.0571 0.0006 1.0792 0.4709 0.0058 0.1222 3.7636 4.5989 6.1007 10.6014 0.2778 0.8289 0.0860 0.0115 4.8562 3.1215 24.0642 28.3995 0.4565 0.0001 225.3947 0.4049 0.4141 10.4517 1.0074 23.9664 0.0116 3.1836 0.0081 0.2934 0.0005 17.0183 6.6928 0.9271 8.3521 0.0011 3.2626 2.4418 3.7792 0.1549 0.7608 20.7420 12.9027 0.2462 0.4616 16.5899 13.3838 18.6268 0.5606 115.9371 4.9347 30.7965 23.9163 17.8072 21.7803 32.2672 0.8746 83.7529 153.4473 163.7231 50.7039 3.6513 3.4242 4.4571 113.1555 62.7735 59.7531 25.1014 20.1372 8.0583 9.0102 37.4224
temp: 298.150 k
press: 1.00000 atm
elementType: 8 6 6 6 6 6 6 6 6 6 6 6 6 6 6 6 6 1 1 1 1 1 1 1 1 1 1 1 1 1 1 1 1 1 1 1 1
symmnumber: 1
zpe: 842613.4 jmol-1
zpe.correction: 0.320935 hartree
zpe.thermalcorrener: 0.334284 hartree
zpe.thermalcorrenthalpy: 0.335228 hartree
zpe.thermalcorrgfe: 0.281678 hartree
zpe.sumelectzpe: -695.674459 hartree
zpe.sumelectthermal: -695.661109 hartree
zpe.sumelectthermalent: -695.660165 hartree
zpe.sumelectthermalfe: -695.713716 hartree
dipole: 0.9292 -1.5778 0.0000
dipole: 1.8311
quadrupole: -101.0719 -95.4424 -105.2620
quadrupole: 10.0644 0.0006 0.0008
quadrupole: -0.4798 5.1497 -4.6699 10.0644 0.0006 0.0008
hfenergy: -695.9953933 hartree
pointgroup: C01 [X(C16H20O1)]
dipole: 0.3717922 -0.6170423 -0.0000061 debye
polarizability: 218.4996781|2.2971438|154.8449758|0.005208|0.0011173|117.4903433 unknown
InChI: InChI=1S/C16H20O/c17-15-3-1-14(2-4-15)16-8-11-5-12(9-16)7-13(6-11)10-16/h1-4,11-13,17H,5-10H2
charge 0 multiplicity 1
37 atoms
O  -5.352552 -0.027538 -0.000273
C  0.456129 0.050464 0.000031
C  2.600829 1.455451 0.000193
C  2.547619 -0.735216 1.268163
C  2.547726 -0.735086 -1.268005
C  1.048854 1.491784 0.000127
C  0.9963 -0.690655 1.270336
C  0.996407 -0.69053 -1.270303
C  3.104119 0.71371 1.267272
C  3.104224 0.71384 -1.266919
C  3.042614 -1.48196 0.000062
C  -1.084757 0.042281 -0.00004
C  -1.867263 1.227951 -0.000051
C  -1.78614 -1.193651 -0.000113
C  -3.277553 1.191277 -0.000129
C  -3.194633 -1.252618 -0.00019
C  -3.944237 -0.051879 -0.000198
H  2.985173 2.494818 0.000263
H  2.897182 -1.268248 2.174741
H  2.897367 -1.268026 -2.174606
H  0.693691 2.044827 0.893466
H  0.693775 2.044914 -0.893192
H  0.592764 -1.721699 1.305085
H  0.628528 -0.170263 2.177476
H  0.628709 -0.170049 -2.177422
H  0.592873 -1.721569 -1.305185
H  4.21255 0.697181 1.282746
H  2.770455 1.248319 2.179617
H  2.770635 1.248542 -2.179237
H  4.212657 0.697314 -1.282304
H  4.149814 -1.53982 0.000107
H  2.661237 -2.52362 -0.000008
H  -1.378508 2.206444 0.000003
H  -1.229035 -2.137885 -0.000109
H  -3.871631 2.110404 -0.000137
H  -3.70455 -2.225754 -0.000244
H  -5.716773 -0.947157 -0.000322
