program: Gaussian 09
title: 000269923
version: EM64L-G09RevD.01
frameworkgroup: C1[X(C12H28Si)]
method: RPBEPBE
basis: SDD
operation: Freq
keyword: #p
keyword: freq=noraman
keyword: PBEPBE/SDD
title: #p freq=noraman PBEPBE/SDD
converged: YES YES NO NO
title: Mulliken charges:
elementType: Si C C C C C C C C C C C C H H H H H H H H H H H H H H H H H H H H H H H H H H H H
charge: 0.975568 -0.790183 -0.808773 -0.788484 -0.320150 -0.317960 -0.319545 -0.341854 -0.340480 -0.342212 -0.694624 -0.693407 -0.694592 -0.089025 0.219939 0.222617 0.226712 0.226996 0.222711 0.219482 0.200290 0.193271 0.195097 0.194079 0.193083 0.200130 0.192882 0.191145 0.192460 0.191506 0.191239 0.192868 0.208041 0.215655 0.209534 0.208152 0.216379 0.208234 0.209532 0.215645 0.208042
chargesum: 0.00000
title: Mulliken charges with hydrogens summed into heavy atoms:
elementType: Si C C C C C C C C C C C C
charge: 0.886543 -0.347627 -0.355065 -0.346292 0.073411 0.071216 0.073669 0.042173 0.043485 0.041895 -0.061393 -0.060642 -0.061373
polarizability: 1.85248195e+02 -5.92097820e-03 1.55241683e+02 6.51564716e-02 4.20747540e-01 1.31312644e+02
1716.lowfreq: -9.5634 -4.8135 -0.0018 -0.0013 0.0016 12.6205 20.6770 27.8329 47.5247
frequency: 18.7206 27.7923 47.5022 50.9122 60.0161 64.1432 86.0191 100.0636 107.2153 126.0000 130.1757 133.6253 178.1550 202.0111 206.8273 223.5643 224.9511 232.0951 253.9904 336.6604 346.4615 377.6954 380.4974 416.0045 623.4744 645.1869 675.1363 697.9938 719.3249 721.3308 730.0582 756.4090 758.4619 785.5217 803.8688 866.9597 886.4345 886.9581 888.1686 890.4343 896.5092 1010.8590 1017.2987 1018.5764 1019.1337 1028.6387 1039.0210 1064.3069 1067.8121 1069.5678 1084.7248 1090.1905 1094.1360 1194.8300 1195.3730 1199.5337 1202.8591 1203.5547 1208.2980 1266.4110 1268.0137 1271.3485 1288.6972 1293.4815 1295.0303 1295.8886 1296.5409 1298.4285 1339.8327 1344.5624 1345.3586 1387.6330 1389.6682 1389.7937 1434.7767 1439.3234 1440.8647 1462.7466 1465.8367 1467.1553 1473.9326 1474.7140 1475.5900 1476.4783 1476.7314 1477.1738 1485.6078 1485.9437 1486.4280 2059.8447 2951.3204 2952.9969 2953.6848 2961.3999 2962.8513 2964.7925 2969.2390 2969.3806 2970.7596 2971.2647 2971.6887 2971.8823 2990.5238 2992.4969 2992.8531 3014.1366 3015.7474 3016.2572 3031.8605 3034.6581 3035.2744 3067.0319 3068.0561 3068.2210 3069.9083 3070.6887 3070.7961
redmass: 3.5206 3.5353 3.0378 1.7333 1.5602 1.5780 2.3866 2.7301 2.6963 2.0105 2.5767 1.8683 3.3312 1.8469 2.4032 1.2115 1.2102 1.2214 3.2162 4.0101 3.0298 3.2584 2.6457 2.9212 1.1303 2.2058 1.4620 1.5565 1.7716 1.2775 1.0946 1.6560 1.2821 1.1689 1.7882 1.3901 1.7694 1.2609 1.7926 1.6080 1.2994 2.1235 3.8072 2.3707 1.8498 1.1327 1.1783 2.5632 2.5983 2.6031 1.8098 1.8684 1.9425 1.4609 1.4571 1.5327 1.4826 1.4783 1.3874 1.2050 1.2004 1.1960 1.0866 1.2956 1.0775 1.3148 1.0795 1.3415 1.5300 1.5214 1.5205 1.2140 1.2146 1.2147 1.0776 1.0774 1.0791 1.0707 1.0677 1.0661 1.0695 1.0698 1.0694 1.0443 1.0428 1.0427 1.0763 1.0784 1.0792 1.0405 1.0586 1.0586 1.0591 1.0587 1.0587 1.0589 1.0557 1.0574 1.0384 1.0575 1.0379 1.0386 1.0980 1.0981 1.0983 1.1012 1.1011 1.1012 1.1031 1.1027 1.1029 1.1006 1.1005 1.1005 1.0993 1.0994 1.0994
irintensity: 0.0001 0.0023 0.0008 0.0095 0.0213 0.0048 0.0137 0.0129 0.0397 0.0278 0.1069 0.0559 0.5332 0.3301 0.3262 0.0252 0.0105 0.0604 1.0550 2.0651 1.9114 1.9307 0.7476 1.9804 6.3800 5.1181 3.4654 5.2670 15.4992 29.8277 18.8183 7.0726 8.0427 52.7130 64.9085 23.6494 1.6181 0.2946 25.3752 14.6217 57.4731 5.9509 2.0345 6.3516 8.8492 3.0663 15.7970 28.9372 4.0720 0.0900 57.3087 13.9998 1.0861 8.4198 11.2078 0.0955 17.2309 2.7955 5.6841 0.6964 3.1091 3.3104 0.1595 0.4819 0.1099 1.8380 0.3372 0.0923 0.4178 0.3055 1.2808 12.6820 13.7385 10.4887 1.2983 5.7120 22.3384 0.3119 0.2437 0.0141 7.5412 2.3458 0.2746 10.8761 14.2959 12.8154 37.0501 3.1817 3.0081 139.5482 4.5742 0.2020 4.5169 0.0005 1.1833 4.1369 16.6456 9.0328 78.2674 211.6752 59.6300 1.9468 0.5954 0.7009 0.3983 0.1302 0.0553 0.0259 31.3561 117.3364 33.4478 85.4688 92.7234 79.7379 48.1264 43.2463 69.5343
temp: 298.150 k
press: 1.00000 atm
elementType: 14 6 6 6 6 6 6 6 6 6 6 6 6 1 1 1 1 1 1 1 1 1 1 1 1 1 1 1 1 1 1 1 1 1 1 1 1 1 1 1 1
symmnumber: 1
zpe: 970982.8 jmol-1
zpe.correction: 0.369828 hartree
zpe.thermalcorrener: 0.389657 hartree
zpe.thermalcorrenthalpy: 0.390601 hartree
zpe.thermalcorrgfe: 0.318824 hartree
zpe.sumelectzpe: -762.352644 hartree
zpe.sumelectthermal: -762.332815 hartree
zpe.sumelectthermalent: -762.331870 hartree
zpe.sumelectthermalfe: -762.403648 hartree
dipole: -0.0061 0.3463 -0.4760
dipole: 0.5887
quadrupole: -94.4145 -94.2578 -95.7508
quadrupole: 0.0451 -0.0748 0.9677
quadrupole: 0.3932 0.5499 -0.9431 0.0451 -0.0748 0.9677
hfenergy: -762.7224719 hartree
pointgroup: C01 [X(C12H28Si1)]
dipole: 0.0022662 0.1329494 0.1896199 debye
polarizability: 185.2476061|-0.050536|155.2491628|0.1773855|-0.004693|131.3057537 unknown
InChI: InChI=1S/C12H28Si/c1-4-7-10-13(11-8-5-2)12-9-6-3/h13H,4-12H2,1-3H3
charge 0 multiplicity 1
41 atoms
Si -0.035027 -0.895688 -0.515403
C  1.541484 -1.3370 0.497196
C  0.000373 0.948577 -1.069119
C  -1.625776 -1.280187 0.498063
C  2.873077 -1.100135 -0.261354
C  0.065505 1.966318 0.099189
C  -2.947159 -0.998104 -0.262923
C  4.122824 -1.498363 0.560269
C  0.09632 3.438608 -0.377359
C  -4.211521 -1.361732 0.552216
C  5.445418 -1.258678 -0.200023
C  0.196389 4.448306 0.786722
C  -5.522983 -1.07952 -0.212844
H  -0.052231 -1.758206 -1.768315
H  1.473106 -2.402629 0.800452
H  1.540713 -0.752126 1.440959
H  -0.897575 1.150256 -1.689108
H  0.870683 1.098847 -1.741055
H  -1.60602 -0.695537 1.441642
H  -1.594581 -2.347636 0.801177
H  2.869283 -1.67349 -1.211812
H  2.958985 -0.030576 -0.546348
H  -0.806375 1.82591 0.772586
H  0.967099 1.772364 0.717322
H  -2.998623 0.075159 -0.542267
H  -2.958001 -1.566312 -1.216461
H  4.042738 -2.567914 0.842988
H  4.128425 -0.925235 1.510018
H  -0.815227 3.643922 -0.974967
H  0.95569 3.575771 -1.065257
H  -4.204083 -0.792519 1.504276
H  -4.164984 -2.434366 0.830805
H  5.561605 -0.191036 -0.466851
H  6.321575 -1.552049 0.407294
H  5.474097 -1.843197 -1.139094
H  1.117046 4.280686 1.377267
H  0.216269 5.490794 0.41884
H  -0.66498 4.349422 1.47446
H  -5.565116 -1.660045 -1.153861
H  -6.410271 -1.34806 0.389779
H  -5.605474 -0.007998 -0.476702
