program: Gaussian 09
title: 000277390
version: EM64L-G09RevD.01
frameworkgroup: C1[X(C19H19Cl2FN6O4S)]
method: RPBEPBE
basis: SDD
operation: Freq
keyword: #p
keyword: freq=noraman
keyword: PBEPBE/SDD
title: #p freq=noraman PBEPBE/SDD
converged: YES YES NO NO
title: Mulliken charges:
elementType: Cl Cl S F O O O O N N N N N N C C C C C C C C C C C C C C C C C C C H H H H H H H H H H H H H H H H H H H
charge: -0.032306 -0.011923 1.089834 -0.347989 -0.323476 -0.234981 -0.479583 -0.483249 -0.320358 -0.081507 -0.156965 -0.623954 -0.609895 -0.448758 0.190237 -0.671831 -0.725210 0.423527 0.209678 -0.014844 -0.385852 -0.391640 -0.265446 -0.255050 0.583362 -0.372880 0.158673 0.515260 -0.136341 -0.422820 -0.314096 -0.186786 -0.208400 0.240673 0.239108 0.196103 0.251748 0.218981 0.236552 0.281570 0.294739 0.342619 0.337614 0.322701 0.326424 0.276054 0.254209 0.372388 0.249954 0.321708 0.286492 0.285934
chargesum: 0.00000
title: Mulliken charges with hydrogens summed into heavy atoms:
elementType: Cl Cl S F O O O O N N N N N N C C C C C C C C C C C C C C C C C C C
charge: -0.032306 -0.011923 1.089834 -0.347989 -0.323476 -0.234981 -0.479583 -0.483249 -0.320358 -0.081507 -0.156965 0.056279 0.039230 -0.076370 0.190237 0.004053 -0.017928 0.423527 0.209678 -0.014844 -0.104282 -0.096901 -0.265446 -0.255050 0.583362 0.157382 0.158673 0.515260 -0.136341 -0.172867 0.007612 0.099706 0.077533
polarizability: 5.17214688e+02 -1.04970057e+01 3.34640170e+02 1.48667320e+01 2.06610963e+01 2.01729701e+02
1716.lowfreq: -7.6182 -0.0016 -0.0007 0.0005 1.6216 2.5269 8.9102 14.8734 19.2659
frequency: 8.5006 14.1674 19.1365 23.0733 31.8926 37.2124 43.3403 55.3680 71.6116 76.1377 92.8847 95.9635 102.9744 111.6814 123.6535 138.3872 161.5065 169.0520 183.7613 187.7125 194.8227 202.9503 213.0024 217.4639 228.9437 240.1392 252.6276 254.0583 281.6585 292.4567 307.7670 316.2325 324.4544 337.7438 343.0113 365.2769 372.4562 381.5009 395.4945 399.6691 402.2248 412.7297 426.3211 437.9644 451.5558 484.9904 502.7013 503.1078 508.8827 517.5042 522.6846 530.2033 539.9496 547.2515 561.4705 572.0641 578.0004 615.8799 617.9015 628.1743 662.7242 682.8700 695.4140 719.2246 723.3193 729.1682 751.3714 781.6708 803.3320 813.9691 839.8712 842.3056 852.6849 858.3889 861.4063 880.7134 885.0997 914.4880 927.5799 945.7747 956.6553 964.3004 973.5882 983.8422 991.8028 992.5343 993.1068 998.6374 1039.7855 1042.9810 1050.4559 1105.1735 1122.9296 1124.5086 1130.3849 1183.9248 1187.1338 1188.7840 1196.5213 1207.7631 1218.5904 1246.1453 1274.5455 1293.0126 1301.6817 1327.9652 1331.6590 1371.2912 1382.9465 1390.2705 1393.1263 1398.5279 1414.5224 1422.6031 1440.8000 1448.0670 1456.8821 1460.9722 1468.7348 1475.3791 1477.5304 1523.4708 1529.5654 1545.5732 1571.6774 1589.2453 1592.7672 1598.7756 1615.1893 1623.0101 1630.0190 2982.9662 3004.2060 3014.5935 3079.9893 3095.5574 3096.9746 3105.7480 3114.4629 3141.5176 3163.4111 3171.0428 3178.9118 3182.2046 3194.9131 3429.7013 3548.2666 3565.7702 3701.2211 3726.4529
redmass: 7.5646 7.3733 7.8390 11.1451 8.2018 5.5644 6.8667 5.2653 6.6982 9.0982 5.6648 8.2437 5.4014 8.0757 4.2778 5.3464 8.2704 7.8734 7.4849 5.7743 1.7531 5.2014 2.1791 5.4786 8.6234 3.1095 5.6103 1.4457 7.2398 10.6045 2.6951 2.8839 10.7665 10.3736 3.6363 7.2461 2.7313 5.6632 1.4982 2.5234 1.6107 2.9914 9.4722 4.4251 6.8306 3.3091 2.0681 4.7536 3.4944 5.4640 1.4505 2.2781 1.8859 4.2007 7.5388 5.3473 3.5270 6.8913 5.2970 4.5270 6.9988 6.1262 6.4341 3.3498 10.1527 6.5702 5.8306 1.2415 4.1423 6.2402 1.3112 5.7076 14.1421 2.6182 1.5099 1.7685 1.3476 1.5781 7.2014 1.8402 5.6108 1.3701 3.7791 5.4780 3.1920 3.0654 1.7242 1.3869 4.0562 2.5890 2.4311 1.8713 2.2528 1.3153 2.0251 1.2671 1.1302 1.8187 2.6496 2.4545 2.1755 3.8955 1.9607 4.8747 1.4000 1.8076 2.9550 1.2364 4.8133 2.4088 1.9524 3.0960 4.5767 5.1170 1.3840 1.0538 2.1112 1.0685 1.0925 2.3359 1.0607 2.7036 5.7160 2.4264 1.7877 6.5017 5.8113 4.7979 2.6897 2.0635 6.4420 1.0355 1.0356 1.0592 1.0994 1.1042 1.0999 1.1007 1.0991 1.0901 1.0915 1.0963 1.0929 1.0930 1.0957 1.0766 1.0447 1.0440 1.1050 1.1058
irintensity: 0.5517 0.1330 0.1501 0.9700 0.1911 1.1249 2.0694 0.0256 0.4220 1.1698 5.7094 0.3090 9.2017 2.1002 0.6893 5.2469 1.7066 0.9763 1.2138 12.7872 1.1361 1.7451 3.3742 1.3973 3.3266 5.3992 15.8285 2.9577 3.0412 4.7142 5.8256 0.9190 20.3209 9.0958 5.0714 4.5376 31.2302 1.5592 131.1902 80.9838 125.5928 0.0767 40.3577 57.9777 1.5098 33.9763 29.8148 3.1824 18.1930 3.9673 19.7259 35.0116 86.8337 50.9710 136.8541 81.1608 6.9962 3.4218 11.5910 11.0702 8.4344 8.2717 7.0251 5.8473 19.7984 46.2781 68.8870 45.4647 58.6491 33.2499 38.8227 3.3950 143.7742 23.2842 82.4375 6.9640 3.5406 2.9709 77.4574 10.6269 88.8535 4.7958 17.5393 8.5766 51.4205 30.4687 2.0613 3.4846 13.8713 18.2940 69.3907 5.3144 4.8667 11.2686 57.3883 9.9111 15.4126 3.6088 49.9725 275.3951 65.9779 91.6927 18.8308 9.6563 26.3245 4.4776 15.2361 40.6208 188.3904 37.8036 59.2232 511.2377 20.6722 278.8906 192.0093 6.6489 225.3447 4.9081 12.5087 23.6615 26.0637 497.0091 216.1766 234.7938 207.4056 115.3564 324.7386 42.6430 656.1329 347.6724 142.3204 19.2487 15.4291 16.4942 30.4130 7.0460 12.8973 24.0844 25.5451 6.1227 3.8754 6.4651 1.5784 0.1928 8.3659 322.9033 64.0609 115.9146 46.4859 41.7044
temp: 298.150 k
press: 1.00000 atm
elementType: 17 17 16 9 8 8 8 8 7 7 7 7 7 7 6 6 6 6 6 6 6 6 6 6 6 6 6 6 6 6 6 6 6 1 1 1 1 1 1 1 1 1 1 1 1 1 1 1 1 1 1 1
symmnumber: 1
zpe: 968675.8 jmol-1
zpe.correction: 0.368949 hartree
zpe.thermalcorrener: 0.402411 hartree
zpe.thermalcorrenthalpy: 0.403355 hartree
zpe.thermalcorrgfe: 0.299444 hartree
zpe.sumelectzpe: -2780.288644 hartree
zpe.sumelectthermal: -2780.255182 hartree
zpe.sumelectthermalent: -2780.254238 hartree
zpe.sumelectthermalfe: -2780.358149 hartree
dipole: 10.9697 0.9857 -3.0551
dipole: 11.4298
quadrupole: -299.8001 -215.9095 -213.7038
quadrupole: -23.0707 0.8532 3.9687
quadrupole: -56.6623 27.2283 29.4340 -23.0707 0.8532 3.9687
hfenergy: -2780.6575933 hartree
pointgroup: C01 [X(C19H19Cl2F1N6O4S1)]
dipole: 4.2852414 -0.8481261 -1.0671904 debye
polarizability: 517.139549|18.908429|226.9999425|0.6894859|-55.9981232|309.4450674 unknown
InChI: InChI=1S/C19H19Cl2FN6O4S/c1-19(2)27-17(23)26-18(24)28(19)11-7-13(20)16(14(21)8-11)32-9-15(29)25-10-3-5-12(6-4-10)33(22,30)31/h3-8,25H,9,23-24H2,1-2H3
charge 0 multiplicity 1
52 atoms
Cl -0.144792 -0.430803 1.414979
Cl 1.573397 0.410286 -3.832158
S  -8.264228 -0.646409 2.002512
F  -8.059108 0.576249 3.392121
O  -0.497598 -0.036241 -1.529535
O  -3.392212 2.022586 -2.327949
O  -9.497179 -0.104186 1.125671
O  -8.270291 -2.094706 2.701402
N  4.932102 0.037137 0.186469
N  6.739767 1.4280 1.16301
N  6.591011 -0.977927 1.612212
N  4.844559 -2.274168 0.779657
N  7.999922 0.40313 2.857582
N  -2.97089 0.295151 -0.767738
C  5.88811 1.249125 -0.023433
C  6.780385 0.964829 -1.262343
C  5.065077 2.538943 -0.199483
C  3.580601 0.023117 -0.270187
C  5.484534 -1.054233 0.873176
C  7.084533 0.332558 1.825999
C  3.264252 0.218896 -1.64084
C  2.521065 -0.181339 0.658817
C  1.194677 -0.175432 0.207317
C  1.922793 0.226571 -2.056711
C  0.846695 0.044393 -1.151608
C  -1.145087 1.131251 -2.183651
C  -2.623128 1.190574 -1.767497
C  -4.228446 0.114905 -0.152709
C  -6.647586 -0.338666 1.1405
C  -4.31828 -0.871535 0.871836
C  -5.378763 0.869801 -0.522969
C  -5.534715 -1.103493 1.534145
C  -6.601479 0.642652 0.135919
H  7.510663 1.784917 -1.371501
H  7.339936 0.022414 -1.126549
H  6.187409 0.899299 -2.19328
H  5.778613 3.378449 -0.207741
H  4.485612 2.557933 -1.137165
H  4.385107 2.682641 0.657269
H  4.062207 0.335251 -2.377505
H  2.745894 -0.322236 1.719097
H  5.241283 -3.038138 1.322221
H  4.120213 -2.456299 0.090175
H  8.428654 1.296366 3.081952
H  8.20465 -0.435668 3.392144
H  -1.089442 1.02743 -3.279655
H  -0.648901 2.072792 -1.882773
H  -2.188237 -0.290157 -0.443039
H  -3.431838 -1.451958 1.1511
H  -5.299126 1.62074 -1.310925
H  -5.620047 -1.859577 2.320241
H  -7.497455 1.209184 -0.136079
