program: Gaussian 09
title: 000269915
version: EM64L-G09RevD.01
frameworkgroup: C1[X(C10H12ClN3O2S)]
method: RPBEPBE
basis: SDD
operation: Freq
keyword: #p
keyword: freq=noraman
keyword: PBEPBE/SDD
title: #p freq=noraman PBEPBE/SDD
converged: YES YES NO NO
title: Mulliken charges:
elementType: Cl S O O N N N C C C C C C C C C C H H H H H H H H H H H H
charge: -0.039830 0.212252 -0.256518 -0.231408 -0.191001 -0.469664 0.036459 0.485348 -0.332633 0.305010 -0.441154 -0.364209 -0.234277 -0.196007 -0.134195 -0.570555 -0.863511 0.271998 0.275838 0.348507 0.232967 0.298457 0.244867 0.240725 0.278372 0.295362 0.267091 0.267161 0.264548
chargesum: 0.00000
title: Mulliken charges with hydrogens summed into heavy atoms:
elementType: Cl S O O N N N C C C C C C C C C C
charge: -0.039830 0.212252 -0.256518 -0.231408 -0.191001 -0.121157 0.036459 0.485348 0.215203 0.305010 -0.208187 -0.065752 -0.234277 0.048860 0.106529 0.003179 -0.064711
polarizability: 3.34526984e+02 -1.92345512e+01 1.71188088e+02 9.88988491e+00 1.10370293e+01 7.92711660e+01
1716.lowfreq: -3.6209 -1.9802 -0.0019 -0.0016 -0.0012 4.4927 26.0016 27.8815 32.0367
frequency: 25.7935 27.8522 32.0174 51.5484 60.8964 72.7689 87.2747 124.4234 152.8449 155.7429 194.6217 222.9237 225.2616 246.8878 277.8759 333.7300 343.1045 367.4958 374.0356 407.7254 420.8228 466.3545 489.8854 512.1379 627.2474 648.6687 677.2510 681.0272 701.6579 715.0326 738.1234 777.0281 791.1864 827.9114 829.4941 838.9429 853.9729 920.6835 946.9921 966.9248 975.0815 988.1466 1002.3542 1041.3650 1052.9146 1074.4082 1096.1459 1134.5651 1200.4729 1208.5855 1235.0125 1265.7865 1268.2586 1306.5068 1324.6262 1350.3036 1357.5324 1367.3984 1376.0119 1415.3926 1437.9403 1454.6465 1455.5595 1462.4237 1485.6713 1516.7705 1586.3319 1613.8022 1656.7287 3008.5636 3045.9422 3070.7981 3120.1726 3123.4508 3125.9883 3135.9869 3151.0176 3158.3376 3160.6153 3191.1053 3437.8918
redmass: 5.1247 7.8630 5.9259 4.2653 2.6905 7.6688 6.6153 7.7278 5.1507 5.0673 9.6263 2.1740 1.7778 6.1114 5.8695 2.9851 6.0092 6.8356 5.5668 3.0268 8.0986 10.4552 9.3212 2.6923 7.1657 6.7023 7.6003 6.9896 6.3733 3.6835 2.0274 1.2200 2.2433 2.5556 1.9103 1.4078 5.2502 2.8154 1.3646 1.1820 1.3262 1.4851 2.6108 2.0613 2.6339 3.8855 2.9883 1.3865 1.1231 1.9395 2.4278 1.7058 1.5481 1.3388 1.2101 1.1460 1.3772 4.7433 5.7254 3.7643 1.1174 1.0522 1.0928 1.0762 2.1543 2.2819 4.3554 6.0776 9.2607 1.0291 1.0590 1.0558 1.1049 1.0885 1.1063 1.1020 1.0961 1.0891 1.1129 1.0950 1.0763
irintensity: 0.2301 0.1600 0.6097 3.1769 1.3836 1.5211 0.3801 9.6674 7.3153 1.4683 3.4641 1.7953 3.0808 3.7488 1.2393 3.7860 0.4738 44.4886 8.2495 0.6440 12.9731 3.5865 6.1841 34.3394 0.4727 3.6314 3.1469 7.1145 65.3387 1.1043 0.6704 33.1766 133.4746 32.9044 41.8787 54.2594 32.0252 139.8488 5.7686 9.3969 2.2089 11.2308 6.7597 71.9363 8.6385 78.0355 19.2716 7.9760 1.0615 4.2479 17.7045 11.1028 1.5732 1.6268 22.2832 0.8431 5.6664 123.3228 179.3504 29.9932 28.5409 16.0662 9.8684 41.7663 33.2336 478.2561 48.2197 23.9706 281.4919 25.7022 2.1269 12.7682 1.2431 10.9567 17.4592 7.5092 9.3952 5.8363 2.6632 2.4748 54.9589
temp: 298.150 k
press: 1.00000 atm
elementType: 17 16 8 8 7 7 7 6 6 6 6 6 6 6 6 6 6 1 1 1 1 1 1 1 1 1 1 1 1
symmnumber: 1
zpe: 560192.0 jmol-1
zpe.correction: 0.213366 hartree
zpe.thermalcorrener: 0.231111 hartree
zpe.thermalcorrenthalpy: 0.232055 hartree
zpe.thermalcorrgfe: 0.164109 hartree
zpe.sumelectzpe: -1559.779446 hartree
zpe.sumelectthermal: -1559.761701 hartree
zpe.sumelectthermalent: -1559.760757 hartree
zpe.sumelectthermalfe: -1559.828703 hartree
dipole: 3.3322 -0.3740 0.1609
dipole: 3.3570
quadrupole: -124.0254 -114.7032 -115.1678
quadrupole: -9.0339 -0.4120 0.2674
quadrupole: -6.0600 3.2623 2.7977 -9.0339 -0.4120 0.2674
hfenergy: -1559.992812 hartree
pointgroup: C01 [X(C10H12Cl1N3O2S1)]
dipole: 1.3127428 -0.0713922 0.1264978 debye
polarizability: 334.7561161|-9.6978187|170.9880033|21.2135466|2.3213805|79.2421186 unknown
InChI: InChI=1S/C10H12ClN3O2S/c1-17-9-4-2-8(3-5-9)12-10(15)14(13-16)7-6-11/h2-5,12H,6-7H2,1H3
charge 0 multiplicity 1
29 atoms
Cl -5.917933 -2.094735 0.356578
S  5.670622 0.128245 0.560344
O  -1.234701 -1.461168 -0.317129
O  -3.95331 2.258364 -0.257582
N  -2.683162 0.388004 -0.336364
N  -0.359842 0.727614 -0.0667
N  -2.772382 1.779836 -0.196316
C  1.038402 0.49528 0.072253
C  -3.860683 -0.47632 -0.57626
C  -1.351026 -0.207799 -0.239704
C  1.871365 1.635583 0.232695
C  1.622472 -0.796228 0.058959
C  3.851165 0.197549 0.365152
C  3.260775 1.488987 0.377346
C  3.01904 -0.934809 0.205296
C  -4.410832 -1.035288 0.74671
C  6.016584 -1.714372 0.494821
H  -4.624579 0.142179 -1.077042
H  -3.545992 -1.303135 -1.231041
H  -0.689168 1.701315 -0.029353
H  1.432828 2.641017 0.2441
H  0.989834 -1.677213 -0.06557
H  3.887176 2.37919 0.499746
H  3.441646 -1.943756 0.191163
H  -4.763859 -0.244402 1.423777
H  -3.690022 -1.701709 1.240411
H  5.711654 -2.134561 -0.476233
H  5.514078 -2.2352 1.324621
H  7.107347 -1.808566 0.608722
