program: Gaussian 09
title: 000277249
version: EM64L-G09RevD.01
frameworkgroup: C1[X(C18H22N2O2)]
method: RPBEPBE
basis: SDD
operation: Freq
keyword: #p
keyword: freq=noraman
keyword: PBEPBE/SDD
title: #p freq=noraman PBEPBE/SDD
converged: YES YES NO NO
title: Mulliken charges:
elementType: O O N N C C C C C C C C C C C C C C C C C C H H H H H H H H H H H H H H H H H H H H H H
charge: -0.273762 -0.293442 -0.384653 -0.488915 -0.072786 -0.404705 -0.413179 -0.416435 -0.420454 -0.377731 0.199506 -0.698163 0.275685 0.130446 0.111890 0.236435 -0.387320 -0.366841 0.140412 -0.255008 -0.202656 -0.795022 0.251896 0.220369 0.190896 0.190213 0.213067 0.208802 0.196950 0.199712 0.214800 0.188483 0.197868 0.369129 0.239120 0.254710 0.323043 0.261747 0.235267 0.228960 0.226145 0.234465 0.270655 0.240402
chargesum: 0.00000
title: Mulliken charges with hydrogens summed into heavy atoms:
elementType: O O N N C C C C C C C C C C C C C C C C C C
charge: -0.273762 -0.293442 -0.015523 -0.165872 0.179110 0.006560 -0.009899 -0.010683 -0.005942 0.008620 0.199506 -0.204334 0.275685 0.130446 0.111890 0.236435 -0.125573 -0.131574 0.140412 -0.026048 0.023489 -0.049501
polarizability: 2.89968185e+02 -3.09403381e+01 2.33382899e+02 3.38559777e+01 6.38349674e+00 1.51332062e+02
1716.lowfreq: -7.7521 -0.0008 -0.0007 -0.0006 2.6732 7.3982 30.7034 40.3159 58.9874
frequency: 30.1749 39.3410 58.0563 66.4064 80.7101 86.7909 95.0375 119.5784 128.1863 147.9926 163.9620 199.5477 223.5353 230.2553 257.2306 276.4002 323.1143 342.0984 364.7949 384.9845 395.8393 429.9069 437.2106 468.5616 476.4256 500.4358 524.2838 530.9838 547.2907 572.7508 577.6905 598.9602 625.5810 639.6401 672.8011 699.5341 754.8749 755.7910 771.5623 791.7324 801.7781 807.2047 816.4041 830.8012 856.5242 866.2581 871.0911 877.4953 919.3003 928.9060 931.1879 945.2667 967.8694 981.4218 1004.2006 1014.0307 1018.4746 1020.9571 1049.5601 1055.0994 1079.4154 1090.5911 1111.6115 1117.4718 1146.4868 1153.5549 1158.7613 1172.3382 1200.3759 1243.1065 1245.1643 1252.6068 1260.5270 1266.1538 1268.6670 1283.8788 1306.4376 1317.6912 1326.1128 1329.1522 1338.9042 1350.3395 1353.7618 1357.2826 1364.3011 1368.9913 1415.8270 1419.3138 1445.4954 1451.4688 1453.3335 1457.4245 1458.2522 1466.0839 1469.5274 1472.4407 1480.6468 1491.5586 1522.3668 1537.0595 1548.3295 1581.7184 1628.1217 1632.5829 2961.4734 2971.3127 2971.9555 2972.4324 2974.5125 2977.0924 3022.1772 3025.4778 3027.7727 3034.0338 3037.8864 3042.4227 3048.3057 3059.7461 3092.2907 3124.0626 3129.7929 3142.0710 3154.0723 3169.3940 3352.8912 3612.7836
redmass: 5.3714 4.1500 4.0148 4.6912 4.2418 4.0579 4.1856 1.4203 2.3979 3.9341 4.4827 4.2846 5.5509 2.4173 4.9562 2.2094 4.0849 4.0074 2.6057 3.3227 3.1022 2.9587 2.4070 2.7307 2.3100 1.2212 3.5880 3.8257 3.6589 4.1129 4.9829 4.2160 2.3627 4.6485 5.6739 4.6809 3.9375 1.4236 1.3715 3.4796 1.7236 2.2060 3.7535 1.5728 1.5721 2.5309 2.5018 4.5961 2.4187 1.8176 1.7424 1.3858 2.2214 1.3212 2.2842 2.2389 2.3913 1.7458 1.4249 1.7774 2.9892 1.7623 1.0401 1.6658 1.5432 2.2457 1.7937 1.1375 2.3857 1.7459 1.3644 2.0739 1.2779 1.8031 1.4254 1.3352 1.6380 4.3320 1.4967 1.3214 1.4420 1.4150 1.8502 1.4720 1.3600 1.2316 5.5943 2.3197 1.8058 1.3207 1.0887 1.1644 1.5537 1.0573 1.0869 1.0886 1.1389 3.1955 1.6786 5.4332 5.3070 5.9676 6.6965 5.6947 1.0629 1.0598 1.0619 1.0653 1.0389 1.0640 1.0589 1.0952 1.0986 1.0951 1.0916 1.1012 1.1020 1.0965 1.1032 1.0980 1.0859 1.0893 1.0954 1.1001 1.0817 1.0803
irintensity: 1.1749 0.2949 3.3907 3.9942 0.0691 2.0351 1.8167 3.3389 1.8346 1.8261 2.7965 0.2837 13.8580 1.9800 4.8391 0.8767 1.0889 0.9523 5.9154 2.4334 1.1635 10.3584 14.0855 1.0564 0.8634 70.0338 14.5568 9.0757 6.2964 3.7568 1.5560 10.9505 12.4751 4.7823 3.0699 1.9194 9.3397 90.3551 33.7608 15.5352 41.3052 26.4324 6.0541 8.4952 0.0080 7.1092 12.3814 8.6665 23.1014 11.4889 13.8880 2.2126 25.4231 0.0872 2.8498 9.4633 4.7113 6.1489 2.4500 0.1830 11.7903 0.6722 0.4954 1.9539 3.9868 18.9168 7.8870 13.3081 11.3913 30.0564 20.2173 115.6054 1.4811 94.2992 5.8020 17.9970 1.0648 53.6841 13.5180 0.1678 0.5858 1.2581 48.9427 1.2677 3.4074 38.6638 16.7259 26.0818 4.1636 87.8623 6.7588 20.3243 35.0914 22.9403 4.8862 8.4893 75.4405 2.6505 390.8917 277.9361 59.1898 8.9052 25.8407 204.5601 41.5321 20.7753 16.8079 37.8960 7.7061 36.6057 12.4587 69.0705 72.6176 2.0265 59.5636 16.6024 123.1361 13.5752 5.5753 9.7637 0.2427 8.8178 20.2406 26.3599 135.8860 58.9807
temp: 298.150 k
press: 1.00000 atm
elementType: 8 8 7 7 6 6 6 6 6 6 6 6 6 6 6 6 6 6 6 6 6 6 1 1 1 1 1 1 1 1 1 1 1 1 1 1 1 1 1 1 1 1 1 1
symmnumber: 1
zpe: 964507.6 jmol-1
zpe.correction: 0.367362 hartree
zpe.thermalcorrener: 0.387489 hartree
zpe.thermalcorrenthalpy: 0.388433 hartree
zpe.thermalcorrgfe: 0.318234 hartree
zpe.sumelectzpe: -957.496213 hartree
zpe.sumelectthermal: -957.476086 hartree
zpe.sumelectthermalent: -957.475142 hartree
zpe.sumelectthermalfe: -957.545341 hartree
dipole: 2.1372 5.2960 1.5487
dipole: 5.9172
quadrupole: -116.5018 -127.9696 -130.6830
quadrupole: 5.9889 2.3872 4.6379
quadrupole: 8.5496 -2.9181 -5.6315 5.9889 2.3872 4.6379
hfenergy: -957.863575 hartree
pointgroup: C01 [X(C18H22N2O2)]
dipole: 0.846665 2.0643792 0.6641764 debye
polarizability: 288.6588374|-32.1373859|233.5139632|34.9965777|7.4778118|152.5103448 unknown
InChI: InChI=1S/C18H22N2O2/c1-12(21)18-15(14-9-5-6-10-16(14)20-18)11-17(22)19-13-7-3-2-4-8-13/h5-6,9-10,13,19-20H,2-4,7-8,11H2,1H3
charge 0 multiplicity 1
44 atoms
O  -0.568795 -2.864858 -0.555467
O  -1.213396 1.805114 -1.306263
N  -1.903175 -0.938054 -0.632198
N  2.097066 1.735921 0.30604
C  -3.022551 -1.483043 0.166622
C  -3.001185 -0.931013 1.620721
C  -4.381762 -1.175778 -0.51373
C  -3.369319 0.570875 1.6837
C  -4.754184 0.326468 -0.449825
C  -4.736888 0.843341 1.010302
C  -0.768991 -1.662321 -0.912806
C  0.291716 -0.869877 -1.728175
C  1.177686 -0.026654 -0.852538
C  2.429941 -0.447656 -0.274499
C  0.97874 1.324075 -0.464238
C  2.983862 0.673111 0.444656
C  3.129814 -1.686666 -0.288809
C  4.2150 0.586439 1.135913
C  -0.126626 2.225417 -0.769256
C  4.352411 -1.774884 0.395767
C  4.888787 -0.648636 1.097056
C  0.022533 3.705228 -0.420221
H  -2.858747 -2.575585 0.198123
H  -2.003835 -1.112949 2.063075
H  -3.734512 -1.510897 2.218344
H  -5.164231 -1.762313 0.009582
H  -4.355718 -1.528503 -1.562054
H  -2.587469 1.166924 1.170066
H  -3.386488 0.908915 2.738109
H  -5.754037 0.481447 -0.899361
H  -4.041986 0.922795 -1.056314
H  -5.534749 0.330272 1.587434
H  -4.967326 1.926151 1.034986
H  -1.909437 0.049384 -0.935517
H  0.897801 -1.621306 -2.260387
H  -0.223409 -0.23344 -2.468413
H  2.202477 2.652434 0.734709
H  2.70536 -2.555606 -0.802003
H  4.632691 1.439476 1.681443
H  4.905799 -2.719777 0.404547
H  5.845809 -0.753648 1.620436
H  0.046168 3.85048 0.678192
H  -0.843841 4.253811 -0.819079
H  0.949694 4.134383 -0.843572
