program: Gaussian 09
title: 000025737
version: EM64L-G09RevD.01
frameworkgroup: C1[X(C4H6Cl4)]
method: RPBEPBE
basis: SDD
operation: Freq
keyword: #pfreq=noraman
keyword: PBEPBE/SDD
title: #p freq=noraman PBEPBE/SDD
converged: YES YES NO NO
title: Mulliken charges:
elementType: Cl Cl Cl Cl C C C C H H H H H H
charge: -0.009125 0.030570 0.016933 -0.024716 -0.245230 -0.319403 -0.551286 -0.567930 0.324892 0.299714 0.288145 0.263278 0.235591 0.258566
chargesum: 0.00000
title: Mulliken charges with hydrogens summed into heavy atoms:
elementType: Cl Cl Cl Cl C C C C
charge: -0.009125 0.030570 0.016933 -0.024716 0.079662 -0.319403 0.036574 0.189506
polarizability: 8.55646428e+01 -3.24575646e+00 8.59089881e+01 2.75464361e+00 3.52685925e+00 6.79818955e+01
1716.lowfreq: -1.2939 -0.0025 -0.0015 -0.0009 5.5591 10.2217 62.5545 70.8251 136.1119
frequency: 62.5349 70.8135 136.1105 179.2236 212.4535 221.0991 250.4103 285.8644 309.1276 331.6750 389.0375 457.2366 548.0144 595.0407 651.5777 716.7125 902.5585 924.3503 1044.7728 1067.3779 1092.2982 1140.8217 1193.5120 1234.6429 1254.2568 1319.5553 1396.3741 1432.5809 1452.3307 1457.0826 3008.1196 3071.9543 3081.1212 3110.4698 3131.6691 3163.4342
redmass: 12.9408 7.8824 12.3707 6.9853 6.2326 10.4291 2.1391 1.5150 3.5913 5.3111 4.0353 5.4116 5.1462 5.5792 3.8560 5.8097 2.0776 1.8733 3.9399 1.4873 1.9454 1.2600 2.5240 1.2505 1.1890 1.3466 1.1941 1.0866 1.0436 1.0445 1.0361 1.0587 1.0849 1.0988 1.1009 1.1089
irintensity: 0.4692 2.2397 1.9976 4.2426 1.6872 1.2608 0.6496 0.6884 2.1520 2.5766 13.1047 8.3547 39.1371 89.3672 19.4325 34.8644 4.1174 18.9977 17.9995 48.5513 14.2656 8.5570 18.1692 7.1647 16.3818 7.9294 24.1867 14.6025 8.8053 11.1147 2.7955 4.1275 1.9688 5.8482 3.2150 0.3612
temp: 298.150 k
press: 1.00000 atm
elementType: 17 17 17 17 6 6 6 6 1 1 1 1 1 1
symmnumber: 1
zpe: 244613.7 jmol-1
zpe.correction: 0.093168 hartree
zpe.thermalcorrener: 0.103110 hartree
zpe.thermalcorrenthalpy: 0.104055 hartree
zpe.thermalcorrgfe: 0.056363 hartree
zpe.sumelectzpe: -1995.623581 hartree
zpe.sumelectthermal: -1995.613639 hartree
zpe.sumelectthermalent: -1995.612695 hartree
zpe.sumelectthermalfe: -1995.660386 hartree
dipole: 1.8130 0.1398 -1.0479
dipole: 2.0987
quadrupole: -81.6402 -77.9756 -73.1260
quadrupole: 2.6992 -3.3148 -1.2795
quadrupole: -4.0596 -0.3950 4.4546 2.6992 -3.3148 -1.2795
hfenergy: -1995.7167493 hartree
pointgroup: C01 [X(C4H6Cl4)]
dipole: 0.7496253 -0.0999639 0.3314424 debye
dipolederiv: -0.2508102 -0.1204787 -0.0248236 -0.0868187 -0.5530799 -0.0024752 -0.0324516 -0.0432198 -0.1229733 -0.238653 0.0129645 0.0805461 0.0204268 -0.1652077 0.0058065 0.0614934 -0.0120941 -0.6956826 -0.2887729 -0.1471978 -0.0557465 -0.0972538 -0.6597996 -0.2266088 -0.0393884 -0.1746587 -0.2778564 -0.5069801 0.0676104 0.045084 0.0448359 -0.1401513 0.0109056 0.1218688 -0.0122045 -0.1777193 0.1220706 0.2156679 0.0369536 0.1027706 0.6523302 0.0260674 0.174622 0.0815436 -0.0830764 0.5283915 0.1358907 -0.0131378 0.1252825 0.8043379 0.2310766 -0.0895037 0.1517772 1.1260595 0.6050033 -0.120163 -0.1830014 -0.0566025 -0.0059968 0.0201556 -0.2265166 0.0409571 0.167035 -0.201604 0.0406954 -0.0251037 0.0467557 -0.1596693 0.0249185 -0.0329149 0.0176493 -0.1267103 0.0479781 -0.0515109 0.0222951 -0.0279861 -0.0107745 -0.0147488 -0.0283576 -0.0171378 -0.0060561 -0.000847 0.0243812 0.0562412 -0.0013335 0.1040878 -0.056216 0.0152248 -0.0230583 -0.0110351 0.0102371 -0.0309121 0.0392363 -0.0246067 -0.020445 -0.0003509 0.036212 -0.0078101 0.0967655 -0.0558713 -0.0314778 0.0156003 -0.0482512 0.0969916 0.015458 0.0213622 0.0232597 0.1107063 0.100042 0.0277307 0.0355993 0.0148837 0.087384 0.014085 0.0375531 0.0173511 -0.0826696 0.1298158 -0.0232004 -0.0297429 -0.0121028 -0.0300076 -0.0480734 -0.0192032 -0.0423546 0.0832128 unknown
polarizability: 84.6447065|4.3772304|84.0902915|-3.5756002|6.4473712|70.7205284 unknown
InChI: InChI=1S/C4H6Cl4/c1-4(7,8)3(6)2-5/h3H,2H2,1H3
charge 0 multiplicity 1
14 atoms
Cl -0.930703 -1.965196 0.037837
Cl 1.369395 0.064387 -1.735173
Cl 1.45636 1.772785 0.805249
Cl -3.109814 0.749456 0.348135
C  -0.46426 -0.164177 0.39898
C  1.043129 0.032425 0.12264
C  -1.387744 0.75877 -0.394984
C  1.995481 -0.956636 0.779099
H  -0.626306 -0.054745 1.484068
H  -1.492773 0.436215 -1.43868
H  -1.03746 1.79991 -0.335719
H  3.037128 -0.649002 0.599295
H  1.813775 -0.986903 1.868148
H  1.837091 -1.964388 0.362506
