program: Gaussian 09
title: 000269900
version: EM64L-G09RevD.01
frameworkgroup: C1[X(C16H20F3NO10)]
method: RPBEPBE
basis: SDD
operation: Freq
keyword: #p
keyword: freq=noraman
keyword: PBEPBE/SDD
title: #p freq=noraman PBEPBE/SDD
converged: YES YES NO NO
title: Mulliken charges:
elementType: F F F O O O O O O O O O O N C C C C C C C C C C C C C C C C H H H H H H H H H H H H H H H H H H H H
charge: -0.173575 -0.134134 -0.140949 -0.248721 -0.284076 -0.287803 -0.255134 -0.257860 -0.209113 -0.239014 -0.223571 -0.221018 -0.238364 -0.373158 -0.168492 -0.115599 -0.063386 -0.030594 -0.078698 -0.380137 0.175514 0.339052 0.322055 0.311929 0.296634 -0.756769 -0.772062 0.308721 -0.757255 -0.757628 0.356097 0.302381 0.283570 0.251742 0.277187 0.251277 0.253537 0.374491 0.254067 0.252387 0.252835 0.242933 0.249605 0.280500 0.256532 0.249472 0.264601 0.271094 0.241833 0.247063
chargesum: 0.00000
title: Mulliken charges with hydrogens summed into heavy atoms:
elementType: F F F O O O O O O O O O O N C C C C C C C C C C C C C C C C
charge: -0.173575 -0.134134 -0.140949 -0.248721 -0.284076 -0.287803 -0.255134 -0.257860 -0.209113 -0.239014 -0.223571 -0.221018 -0.238364 0.001333 0.187605 0.186782 0.220184 0.221148 0.198489 0.124676 0.175514 0.339052 0.322055 0.311929 0.296634 0.002521 0.000977 0.308721 0.013350 0.002361
polarizability: 2.31166996e+02 -1.57845078e+01 2.25106409e+02 -9.75772623e+00 -3.89106486e+00 1.80845434e+02
1716.lowfreq: -23.4900 -2.6597 -0.0004 -0.0001 0.0006 5.6964 7.7509 11.5874 18.7016
frequency: -23.3493 11.4598 18.6684 22.3241 26.6298 33.8108 37.2507 42.6260 48.5707 52.8542 55.6967 62.9206 67.7866 79.8757 81.2516 90.4344 91.8134 118.8381 126.8080 134.5693 136.6356 158.6691 175.2178 188.6763 198.1446 207.5107 212.0474 239.5365 250.9386 263.9291 279.2066 293.5693 300.1133 347.1855 365.7045 373.4365 379.9046 389.4570 434.9040 443.1838 473.3466 477.6846 500.7569 505.7832 524.6240 549.1308 558.3853 561.0921 564.0944 574.0591 609.1503 622.3720 625.8386 628.2206 642.3704 647.1989 672.2389 711.2485 737.2221 775.9985 807.5299 826.4450 843.7838 856.7270 869.8814 882.4995 912.7390 952.2227 969.8260 982.5855 988.0218 990.4261 1000.9588 1005.0447 1015.3914 1019.2638 1035.1539 1041.7485 1042.2091 1043.8733 1044.8174 1046.4077 1055.6309 1077.8157 1100.2170 1128.4217 1145.1403 1157.3708 1172.0159 1175.4283 1187.9137 1196.9869 1218.9000 1238.8921 1241.9879 1257.1848 1294.5730 1297.2703 1310.4332 1329.8624 1337.5267 1344.0084 1354.3601 1368.8659 1381.2081 1382.7141 1385.3129 1387.0693 1388.5611 1449.2863 1450.9188 1451.7371 1452.3434 1452.6854 1454.5169 1455.3462 1456.7716 1457.0683 1496.1996 1646.8650 1669.0375 1670.0348 1671.7345 1679.6385 3001.0210 3001.6812 3004.6644 3008.2374 3008.6428 3026.5058 3027.8052 3031.2897 3054.9936 3066.0625 3096.4365 3098.4922 3098.8569 3099.8528 3114.8930 3141.3916 3142.1268 3145.3445 3145.4605 3513.2028
redmass: 1.1133 13.8239 5.9350 6.9639 8.8779 7.8867 12.3289 5.4940 5.6683 3.9730 5.4168 4.0422 3.0040 3.1820 4.2507 3.0500 1.8005 1.0449 1.0407 6.0853 7.0750 7.3644 7.6313 7.9002 9.1936 6.5679 8.9694 4.6859 6.9125 10.3598 10.0482 2.8601 6.9504 7.0743 3.8330 5.0467 8.5967 3.4997 5.0972 8.9944 5.0790 4.2199 3.4430 4.9312 8.1085 3.2406 3.2547 3.4912 3.4204 4.7032 4.5560 4.8759 4.2291 7.2982 2.7547 7.4219 1.5995 9.3091 5.8181 4.5840 6.0087 5.3367 5.6279 4.8209 5.1283 4.4606 3.9852 4.7607 3.6873 2.7369 2.0285 2.1691 3.0308 2.8217 8.3262 4.5339 7.6015 1.7333 3.3969 1.7760 1.6719 1.7596 2.6479 3.5525 3.5122 4.3278 2.3571 4.2586 2.9583 2.9210 3.4169 3.2117 1.4233 1.6390 1.1601 1.7067 1.1853 1.2267 1.3175 1.4831 1.4626 1.4111 1.3331 1.3955 1.3690 1.2429 1.2476 1.2782 1.2932 1.0883 1.0556 1.0527 1.0589 1.0529 1.0507 1.0531 1.0531 1.0531 1.9498 11.0242 9.8978 9.6753 10.0465 10.1517 1.0838 1.0389 1.0383 1.0380 1.0376 1.0782 1.0819 1.0675 1.0855 1.0873 1.0939 1.0962 1.0953 1.0941 1.1050 1.1021 1.1023 1.1018 1.1013 1.0782
irintensity: 1.2847 0.4482 0.3071 0.3748 0.0441 1.1723 0.9563 0.4630 0.8304 8.9042 0.5702 1.3724 0.0901 0.7783 0.8837 7.8453 3.5788 0.5041 0.3045 2.2754 2.3869 1.1038 0.3466 6.9010 5.5159 5.1905 14.1114 0.2007 4.6935 7.6712 5.6114 7.0837 1.7196 6.2487 13.2742 9.9348 12.7100 13.6274 7.7527 3.4986 5.5650 4.8518 3.1831 24.2051 6.9245 7.6534 3.0453 6.3180 5.6702 21.8354 8.5717 6.6352 14.4751 21.3225 25.2636 1.9261 88.5574 8.3245 13.0452 18.0531 6.2512 37.6701 92.6887 32.3450 84.8513 30.9569 114.7984 53.8023 49.4191 55.0168 22.8403 56.9820 170.5458 208.4183 135.8920 48.8423 83.6397 25.4738 285.6549 34.1850 20.2298 49.3620 17.2931 57.3317 94.5810 19.6402 14.2146 136.4129 38.8818 316.7304 745.9135 67.1429 18.8706 36.9865 12.4335 1.0995 11.0377 15.4930 10.7007 5.5849 3.1717 4.7246 2.6150 10.5877 4.4189 61.1610 62.7766 76.7218 34.7939 16.2932 24.8903 27.0735 24.0989 22.0845 18.0812 11.3131 12.0821 23.8616 191.1156 221.3348 249.1263 53.7373 190.9855 208.5383 8.0828 1.4062 1.2443 0.1164 0.8083 11.0769 20.1370 12.4101 5.9299 3.6571 7.5749 5.3904 4.6454 5.2722 4.5608 9.2980 7.0984 8.5297 6.6382 72.4676
temp: 298.150 k
press: 1.00000 atm
elementType: 9 9 9 8 8 8 8 8 8 8 8 8 8 7 6 6 6 6 6 6 6 6 6 6 6 6 6 6 6 6 1 1 1 1 1 1 1 1 1 1 1 1 1 1 1 1 1 1 1 1
symmnumber: 1
zpe: 948862.0 jmol-1
zpe.correction: 0.361402 hartree
zpe.thermalcorrener: 0.393510 hartree
zpe.thermalcorrenthalpy: 0.394454 hartree
zpe.thermalcorrgfe: 0.291517 hartree
zpe.sumelectzpe: -1725.942956 hartree
zpe.sumelectthermal: -1725.910849 hartree
zpe.sumelectthermalent: -1725.909905 hartree
zpe.sumelectthermalfe: -1726.012842 hartree
dipole: -4.5464 -3.9082 3.5208
dipole: 6.9527
quadrupole: -194.6043 -156.6149 -171.8777
quadrupole: -13.3787 -3.0377 4.8702
quadrupole: -20.2387 17.7507 2.4879 -13.3787 -3.0377 4.8702
hfenergy: -1726.304359 hartree
pointgroup: C01 [X(C16H20F3N1O10)]
dipole: -1.8897477 0.3343325 -1.94921 debye
polarizability: 211.5714497|14.9524559|237.7929918|15.4207101|-5.1335907|187.7543986 unknown
InChI: InChI=1S/C16H20F3NO10/c1-6(21)26-5-10-12(27-7(2)22)13(28-8(3)23)11(14(30-10)29-9(4)24)20-15(25)16(17,18)19/h10-14,20H,5H2,1-4H3
charge 0 multiplicity 1
50 atoms
F  2.269993 -2.030481 2.901468
F  4.149784 -0.752249 2.90198
F  4.165507 -2.783661 1.897759
O  -1.212178 -0.842371 0.055885
O  0.434274 1.459395 -2.020192
O  -0.693664 2.842792 0.220632
O  -0.060912 -2.588823 -0.974554
O  -3.948398 0.12271 0.400247
O  3.84783 -0.525832 -0.015046
O  1.488802 3.53495 -1.783524
O  0.924057 3.313066 1.838238
O  -2.065853 -2.878417 -2.155512
O  -3.819407 -1.625524 1.954676
N  1.620147 -0.959772 0.558416
C  0.817337 1.077889 -0.633609
C  1.076646 -0.455945 -0.708906
C  -0.342527 1.411866 0.338024
C  -1.602954 0.591028 0.002259
C  -0.258611 -1.153418 -1.016719
C  -2.752775 0.766099 0.989331
C  2.973316 -0.975578 0.771042
C  0.835149 2.734655 -2.480689
C  0.088767 3.728938 1.011837
C  -1.103356 -3.380457 -1.547706
C  3.392083 -1.63065 2.116393
C  0.347262 2.945942 -3.893805
C  -0.23113 5.158917 0.669283
C  -4.313824 -1.141977 0.916539
C  -0.835447 -4.838397 -1.279546
C  -5.34642 -1.778071 0.017183
H  1.733811 1.620645 -0.345693
H  1.815241 -0.640129 -1.508884
H  0.00222 1.202725 1.369313
H  -1.953085 0.839558 -1.02018
H  -0.669446 -0.832867 -1.993069
H  -2.521552 0.299393 1.963934
H  -2.997544 1.833001 1.107099
H  0.971068 -1.380736 1.231407
H  -0.750253 3.073171 -3.892549
H  0.815114 3.846779 -4.315688
H  0.577438 2.069012 -4.52086
H  -1.294402 5.281272 0.410074
H  0.043319 5.816634 1.507188
H  0.372375 5.438373 -0.214275
H  0.227267 -5.077291 -1.447138
H  -1.476427 -5.461418 -1.919556
H  -1.060066 -5.059211 -0.220145
H  -4.829537 -2.212971 -0.858802
H  -5.873103 -2.578915 0.556598
H  -6.061434 -1.026851 -0.354255
