program: Gaussian 09
title: 000269878
version: EM64L-G09RevD.01
frameworkgroup: C1[X(C20H24N2O11)]
method: RPBEPBE
basis: SDD
operation: Freq
keyword: #p
keyword: freq=noraman
keyword: PBEPBE/SDD
title: #p freq=noraman PBEPBE/SDD
converged: YES YES NO NO
title: Mulliken charges:
elementType: O O O O O O O O O O O N N C C C C C C C C C C C C C C C C C C C C H H H H H H H H H H H H H H H H H H H H H H H H
charge: -0.234039 -0.282737 -0.278144 -0.312821 -0.238569 -0.237995 -0.237609 -0.218220 -0.259288 -0.228319 -0.225303 -0.381465 0.018864 -0.093651 -0.122125 -0.096554 -0.065036 -0.177114 -0.350438 0.487690 0.328206 0.315025 0.323949 -0.303763 -0.408789 -0.761659 -0.778711 0.295264 -0.760195 -0.378929 -0.348097 0.382280 -0.751348 0.297876 0.293144 0.305658 0.288811 0.218701 0.266168 0.249370 0.317990 0.270768 0.233905 0.258475 0.250368 0.253137 0.292717 0.245739 0.242578 0.255787 0.264936 0.249142 0.284790 0.284903 0.253175 0.246497 0.255008
chargesum: 0.00000
title: Mulliken charges with hydrogens summed into heavy atoms:
elementType: O O O O O O O O O O O N N C C C C C C C C C C C C C C C C C C C C
charge: -0.234039 -0.282737 -0.278144 -0.312821 -0.238569 -0.237995 -0.237609 -0.218220 -0.259288 -0.228319 -0.225303 -0.063475 0.018864 0.204225 0.171019 0.209104 0.223774 0.041586 0.165100 0.487690 0.328206 0.315025 0.323949 -0.032995 -0.174885 0.000321 0.002323 0.295264 0.009670 -0.094140 -0.063194 0.382280 0.003332
polarizability: 3.81753275e+02 -1.85364256e+01 2.56878542e+02 4.21008770e+00 -2.81986825e+01 2.35104178e+02
1716.lowfreq: -4.0336 -0.7545 -0.0006 -0.0004 0.0007 4.7510 14.4940 20.4665 23.5819
frequency: 14.4260 20.4396 23.4953 27.3040 30.7062 35.4679 39.6394 41.4336 44.7000 53.2269 57.7665 62.3111 65.6117 69.9101 79.1372 81.7381 83.0820 91.3300 95.2208 112.6364 122.4554 139.5687 158.3172 169.8496 191.8163 199.5003 203.0631 229.8491 235.9510 244.9837 267.4605 287.1988 305.6229 311.4529 341.7410 352.2372 382.5905 399.2683 417.3200 424.4505 432.5053 459.6399 481.3636 490.4366 496.3203 512.4919 525.1406 553.3036 557.3315 563.6631 571.6311 575.9804 584.6171 594.6878 609.7989 620.3861 630.7337 634.5006 656.7968 664.5908 667.8754 722.8685 731.3338 752.7720 772.8191 787.2577 817.0330 821.0374 830.3018 843.6999 854.2003 873.2206 887.2357 921.0309 939.9976 961.4110 975.9239 977.4385 982.6216 987.7871 991.5677 994.9457 997.0705 1002.5432 1014.2510 1017.2777 1041.9257 1042.5734 1043.8160 1046.9887 1051.0674 1093.8725 1099.0626 1106.5344 1116.4763 1161.8444 1169.7807 1178.2162 1181.3883 1181.8234 1189.0727 1205.3303 1231.6643 1237.9047 1260.7669 1264.2710 1282.6877 1291.2540 1298.5188 1308.4954 1310.9918 1315.3204 1327.9517 1336.3340 1346.7268 1352.1240 1373.6686 1383.0769 1384.9628 1386.5220 1387.4548 1389.1579 1401.3529 1439.5243 1444.4373 1452.0445 1452.6541 1452.8712 1453.0116 1453.9126 1454.7439 1455.4037 1460.7168 1484.6197 1515.1239 1591.2070 1622.3189 1640.0781 1664.5369 1667.2562 1676.7767 2973.6714 3004.7929 3006.3669 3007.3584 3007.4602 3027.3759 3034.3469 3038.1518 3041.2655 3053.9677 3100.0509 3100.7217 3101.0533 3101.1289 3129.0483 3133.6882 3141.4649 3142.5124 3142.6945 3144.7246 3164.7897 3182.7203 3186.1410 3536.0625
redmass: 6.7993 5.8988 6.9575 4.4957 1.7899 2.8899 5.5274 3.5616 3.5510 1.3893 2.2529 7.9359 6.0543 1.4606 5.3466 2.7391 4.4076 4.4306 4.1747 5.5824 6.0175 1.0391 6.4355 8.8036 6.2906 6.5120 6.9667 7.0895 5.9240 7.1343 5.9602 6.2531 5.6776 3.3278 4.3135 4.1583 4.0159 4.4005 2.9989 4.2635 3.0687 4.1145 4.4868 4.6265 2.8617 3.9967 3.7903 3.5863 2.8739 3.2650 3.2152 3.0448 2.1207 5.7827 5.5697 5.5798 6.7539 5.2346 5.7113 4.5339 5.2176 4.3758 4.7027 4.8623 7.5247 4.3632 5.6365 1.2962 5.2392 2.1174 4.0035 4.0866 5.8269 3.6883 5.4327 4.3600 3.1298 1.3725 1.3659 2.4970 2.1720 2.9940 2.6546 2.5263 2.7234 4.2353 1.8717 1.8169 1.6983 1.9327 1.7246 3.5739 2.9872 2.8818 1.3521 3.5080 2.7807 3.0204 2.0885 1.7866 3.0107 3.3993 3.1260 1.6447 1.3065 1.1581 1.3494 1.2700 1.2016 1.3703 1.2164 1.4842 1.3630 1.4326 1.4761 5.4254 1.5130 1.2794 1.2441 1.2829 1.2307 1.2848 4.0843 1.0969 4.2384 1.0549 1.0542 1.0532 1.0584 1.0589 1.0562 1.0535 1.0548 1.9286 2.6470 6.1573 6.4432 8.9410 10.0475 10.1262 10.2469 1.0837 1.0379 1.0389 1.0388 1.0385 1.0834 1.0624 1.0840 1.0829 1.0863 1.0933 1.0942 1.0942 1.0936 1.1046 1.0904 1.1027 1.1026 1.1024 1.1022 1.0886 1.0946 1.0966 1.0760
irintensity: 0.6976 0.0618 0.5963 0.9742 1.0350 0.7034 0.6516 1.5169 0.3551 3.0592 0.9968 1.8929 1.1046 1.1123 0.4146 0.8651 9.6585 1.5950 2.3872 5.2004 0.9317 0.3927 1.0163 2.4418 1.7704 2.7041 3.1045 2.5902 9.1677 3.6013 4.4319 7.1943 7.9996 14.3123 9.1421 5.9296 1.4690 6.5918 0.5620 12.1336 14.3030 17.1038 7.0959 11.8111 26.0239 5.2008 3.4421 15.6394 11.8305 21.2066 5.0864 34.1981 83.2496 8.2091 8.3749 2.0467 10.0945 2.9364 1.9189 22.2518 4.8198 19.7613 1.8422 79.3814 18.0789 2.1497 13.8214 0.5435 11.9789 65.2708 81.7636 116.2991 140.3748 7.3742 273.7466 31.8445 13.0241 4.8841 1.7627 48.0155 61.6452 1.7164 152.2915 130.5161 98.7273 142.3845 4.3046 36.5135 28.8415 25.8744 24.9483 59.0229 34.3988 22.0491 10.1160 138.9811 57.8477 479.3086 15.0320 413.2104 260.3741 408.1621 396.7328 50.3847 22.0869 32.7657 23.7318 28.9068 3.3319 6.6382 1.0341 46.8497 2.5032 44.4994 12.6272 90.8205 6.7466 26.5982 60.6247 52.3853 61.9179 58.7341 75.2370 25.6439 12.6678 13.6799 27.3621 8.4398 30.7860 12.4685 11.3107 17.9656 20.4724 11.5754 326.3565 24.9972 442.6096 168.7347 155.5201 193.1355 143.4168 22.7338 4.9165 0.2917 1.0135 0.6780 20.1894 9.3610 8.9851 20.2190 8.2815 5.8544 4.7874 3.6966 8.9355 3.0644 11.0202 6.1581 4.0428 10.4563 7.1648 5.5397 0.3331 7.2647 87.2293
temp: 298.150 k
press: 1.00000 atm
elementType: 8 8 8 8 8 8 8 8 8 8 8 7 7 6 6 6 6 6 6 6 6 6 6 6 6 6 6 6 6 6 6 6 6 1 1 1 1 1 1 1 1 1 1 1 1 1 1 1 1 1 1 1 1 1 1 1 1
symmnumber: 1
zpe: 1127597.0 jmol-1
zpe.correction: 0.429479 hartree
zpe.thermalcorrener: 0.464217 hartree
zpe.thermalcorrenthalpy: 0.465162 hartree
zpe.thermalcorrgfe: 0.355767 hartree
zpe.sumelectzpe: -1710.951965 hartree
zpe.sumelectthermal: -1710.917226 hartree
zpe.sumelectthermalent: -1710.916282 hartree
zpe.sumelectthermalfe: -1711.025677 hartree
dipole: 7.9289 -2.5166 3.6785
dipole: 9.0958
quadrupole: -262.3597 -186.7470 -176.8229
quadrupole: 14.7588 -16.1583 8.4099
quadrupole: -53.7165 21.8962 31.8203 14.7588 -16.1583 8.4099
hfenergy: -1711.3814437 hartree
pointgroup: C01 [X(C20H24N2O11)]
dipole: 2.3835465 2.0588385 -1.6987927 debye
polarizability: 340.1653572|63.6761072|288.5219316|3.186898|-32.9640142|245.0487059 unknown
InChI: InChI=1S/C20H24N2O11/c1-10(23)29-9-16-17(30-11(2)24)18(31-12(3)25)19(32-13(4)26)20(33-16)21-14-5-7-15(8-6-14)22(27)28/h5-8,16-21H,9H2,1-4H3
charge 0 multiplicity 1
57 atoms
O  0.306075 -1.024943 -0.016647
O  1.194001 2.907785 1.229182
O  3.361065 0.879031 1.154676
O  -0.063461 1.47328 -1.784243
O  2.855393 -2.047274 -1.607903
O  2.328889 4.296832 -0.275097
O  3.40374 -0.566227 2.987098
O  -0.753313 3.710321 -1.756548
O  4.752976 -1.910796 -0.258279
O  -6.946052 -3.943286 0.55153
O  -5.720773 -4.392213 2.426998
N  -1.866692 -0.213547 -0.533206
N  -5.894524 -3.787829 1.293839
C  1.308374 1.788289 0.266584
C  1.919329 0.593676 0.998614
C  -0.10463 1.472089 -0.294144
C  1.74247 -0.715779 0.184421
C  -0.658653 0.109217 0.165384
C  2.480246 -0.674702 -1.170858
C  -2.826578 -1.119837 -0.072892
C  1.752641 4.146745 0.820179
C  4.024216 0.158583 2.182162
C  -0.37649 2.717705 -2.406883
C  -2.669189 -1.832784 1.153712
C  -4.008691 -1.325023 -0.847255
C  1.509792 5.195343 1.876284
C  5.509835 0.37766 2.095269
C  4.034879 -2.56156 -1.054144
C  -0.155617 2.628425 -3.895459
C  -3.676208 -2.698253 1.603521
C  -5.011065 -2.197909 -0.406495
C  -4.844136 -2.875661 0.825216
C  4.278342 -3.974684 -1.528194
H  1.968393 2.112058 -0.559685
H  1.469216 0.458907 1.999555
H  -0.79666 2.270623 0.031126
H  2.141573 -1.547218 0.790299
H  -0.873223 0.19508 1.250923
H  1.818879 -0.30591 -1.968455
H  3.399682 -0.068209 -1.090901
H  -1.891356 0.058174 -1.518448
H  -1.742314 -1.7454 1.726099
H  -4.136247 -0.78249 -1.791221
H  0.474986 5.572467 1.781511
H  2.203271 6.036302 1.730935
H  1.621467 4.769888 2.88588
H  5.903498 -0.326116 1.338359
H  5.743852 1.402216 1.766576
H  5.981237 0.161721 3.065274
H  -0.839483 3.316159 -4.415619
H  0.879779 2.944427 -4.121224
H  -0.285475 1.598761 -4.261806
H  -3.570358 -3.25677 2.537269
H  -5.922569 -2.362383 -0.986875
H  3.883237 -4.124106 -2.544542
H  5.355048 -4.198974 -1.492144
H  3.756274 -4.679386 -0.854908
