program: Gaussian 09
title: 000277388
version: EM64L-G09RevD.01
frameworkgroup: C1[X(C21H26FN5O2S)]
method: RPBEPBE
basis: SDD
operation: Freq
keyword: #p
keyword: freq=noraman
keyword: PBEPBE/SDD
title: #p freq=noraman PBEPBE/SDD
converged: YES YES NO NO
title: Mulliken charges:
elementType: S F O O N N N N N C C C C C C C C C C C C C C C C C C C C C H H H H H H H H H H H H H H H H H H H H H H H H H H
charge: 1.080080 -0.349260 -0.479003 -0.479925 -0.321891 -0.090628 -0.174658 -0.633199 -0.615165 0.182337 -0.370954 -0.591429 0.331910 -0.369291 0.518339 -0.683566 -0.707328 -0.536587 -0.559116 0.220493 -0.359733 -0.422836 0.535663 -0.220555 -0.025985 -0.360926 -0.417688 -0.093060 -0.195356 -0.256046 0.209974 0.205294 0.213157 0.215652 0.204639 0.241802 0.241361 0.229801 0.205911 0.267502 0.200129 0.216161 0.267327 0.218781 0.209671 0.256981 0.238268 0.228903 0.284120 0.246565 0.332170 0.338984 0.246042 0.290904 0.316688 0.318572
chargesum: 0.00000
title: Mulliken charges with hydrogens summed into heavy atoms:
elementType: S F O O N N N N N C C C C C C C C C C C C C C C C C C C C C
charge: 1.080080 -0.349260 -0.479003 -0.479925 -0.321891 -0.090628 -0.174658 0.037955 0.020095 0.182337 0.044315 -0.162620 0.331910 0.077151 0.518339 -0.006493 -0.023536 -0.269260 -0.130664 0.220493 -0.102752 -0.184568 0.535663 0.008348 -0.025985 -0.076806 -0.171123 -0.093060 0.050686 0.034858
polarizability: 4.24449199e+02 -3.34597744e+00 3.55591747e+02 1.17782230e+00 1.69995326e+01 2.64706138e+02
1716.lowfreq: -4.1879 -0.0014 -0.0011 0.0012 0.5935 6.4276 10.3327 14.4916 20.4893
frequency: 10.0840 14.3176 20.4074 25.3448 30.4700 35.5344 41.6702 57.3111 79.6302 90.3538 99.9385 107.5062 125.6425 128.3253 156.3707 181.7352 191.8890 204.8831 214.2997 228.8308 236.5100 237.7667 249.6115 255.3895 266.6287 278.0539 286.3034 302.8417 305.4179 316.1440 319.6038 353.6835 365.2038 369.1332 388.4993 389.6442 406.2113 420.9830 439.3492 444.7864 462.4621 490.5599 499.3363 517.3525 520.0178 522.7683 526.8775 546.1429 551.6480 555.8862 590.8556 615.0551 637.0345 656.0402 666.6777 685.8802 690.6383 712.1708 723.6045 743.1418 791.0978 797.8455 810.1785 813.0962 824.6989 847.3345 857.1776 862.6396 875.8443 908.0477 911.8092 920.4661 924.0991 930.2265 946.0453 961.1797 977.8450 985.0106 987.1077 990.1753 990.3221 994.2465 1002.2587 1032.6182 1039.6240 1052.6364 1056.1382 1069.8672 1087.1798 1097.6677 1103.7547 1119.1784 1127.9393 1129.8608 1174.3268 1177.4522 1178.8831 1190.5992 1196.3127 1210.8608 1244.4006 1251.4870 1267.5016 1281.0366 1288.6167 1296.5331 1300.6985 1317.1914 1327.3607 1355.7878 1362.7562 1368.3158 1383.2796 1384.7715 1400.0300 1424.6224 1429.5818 1447.8703 1448.2542 1460.0922 1461.8043 1466.6490 1468.8943 1471.1230 1472.4777 1477.4470 1480.3473 1486.3926 1524.8666 1563.7907 1568.5808 1584.2957 1602.1519 1607.6823 1610.7885 1613.6657 2964.8976 2974.3190 2980.1438 2983.7982 2985.8075 2992.5137 3013.3802 3029.8905 3042.6169 3055.7018 3079.9978 3092.1372 3094.5851 3111.3271 3119.4475 3135.0970 3135.5573 3141.5079 3147.9881 3158.2159 3163.0905 3175.9061 3552.6075 3567.6608 3708.4971 3730.6828
redmass: 6.0384 6.2056 4.4465 9.5195 8.1451 5.7187 4.8002 4.6171 4.5000 4.7935 5.9147 2.1737 4.4930 5.1482 2.7508 4.6836 5.3851 5.4378 6.6912 5.6006 3.4749 1.2990 4.1399 2.6827 3.7487 1.0870 4.3722 9.1819 2.6313 4.1288 2.6724 2.5680 1.7782 1.6771 1.2194 3.2272 3.2018 9.9355 3.1586 3.6573 3.1315 2.3402 2.8410 4.5018 1.7258 1.6642 2.2629 2.6454 4.9698 7.4140 5.8988 5.0542 3.9620 6.4092 7.0345 5.9447 2.4455 2.0360 10.7267 1.2167 1.8416 1.4588 2.0289 3.5350 4.0830 2.2299 8.0036 3.0391 1.6033 1.5012 1.5457 1.4082 1.5028 1.3548 1.8432 2.9477 5.1804 1.3784 1.8155 5.0224 4.5818 1.4061 2.5821 2.6932 2.1082 3.0579 2.2001 2.0992 1.8308 1.5872 1.9566 2.0794 1.2955 1.8493 1.5032 1.1961 1.1106 1.9442 1.9704 2.1158 3.7045 1.3493 1.3061 3.3646 1.1374 1.3133 1.2592 1.3754 1.4281 1.4987 1.2274 7.1884 5.0814 1.2983 4.0280 2.5461 2.8995 1.3152 2.2497 1.1201 1.1161 1.9269 1.0856 1.2817 1.9324 1.2172 1.0869 1.1028 2.7488 6.2231 1.8403 5.5744 3.3359 2.8110 6.4411 2.2624 1.0593 1.0600 1.0346 1.0615 1.0597 1.0359 1.0973 1.1022 1.1026 1.1046 1.1004 1.1003 1.0999 1.0985 1.0875 1.0921 1.0890 1.0919 1.0925 1.0915 1.0980 1.0988 1.0443 1.0436 1.1053 1.1059
irintensity: 1.0024 0.3237 0.2651 0.2599 0.1575 0.2107 0.3751 0.0044 0.5846 0.4593 0.5027 0.2422 1.5600 0.7313 0.6422 2.9793 2.7750 4.0151 2.0027 3.6393 4.0309 2.0663 3.6465 0.7173 1.3140 0.2410 6.9825 26.3316 15.7297 1.1107 1.2929 12.0276 111.1787 66.9426 210.9789 8.2620 4.1779 98.5973 8.9728 20.0056 10.3946 45.3688 1.3350 9.1838 24.7150 58.5877 58.7781 24.3640 37.2727 96.3551 8.5452 5.2679 0.8685 2.6684 4.2494 3.5921 37.4465 25.3207 22.9677 9.1876 16.0677 34.3330 28.3391 38.0821 17.5840 13.7388 38.8195 20.0495 2.2328 15.7706 1.4739 1.2120 0.1751 1.8416 2.6840 5.4856 10.9986 2.7670 0.3847 29.2196 34.0395 1.2124 6.4895 11.0459 3.3532 9.4444 12.8989 0.7721 19.1668 8.6957 5.3638 3.1078 11.0227 29.8077 11.6427 2.3802 1.1399 21.6363 12.1658 0.0245 35.5256 2.9465 7.1607 72.4768 5.8389 5.3632 2.6954 5.1326 4.7443 5.4735 41.3977 0.9045 13.2868 33.4522 410.7714 7.8822 5.5299 20.4461 53.7519 0.2760 13.6075 13.4584 8.1842 13.2807 29.0866 17.4761 17.7901 12.3334 354.0198 4.9163 260.2721 74.4528 479.5549 173.7267 31.7864 693.1785 21.8152 6.2219 22.9212 27.0816 67.2294 13.1884 13.5392 11.5765 22.0047 66.6149 20.3470 28.7980 11.4933 18.1544 5.7882 8.5577 7.3437 18.4411 2.5415 9.1242 11.4428 9.7890 70.9630 100.7993 48.4530 36.2898
temp: 298.150 k
press: 1.00000 atm
elementType: 16 9 8 8 7 7 7 7 7 6 6 6 6 6 6 6 6 6 6 6 6 6 6 6 6 6 6 6 6 6 1 1 1 1 1 1 1 1 1 1 1 1 1 1 1 1 1 1 1 1 1 1 1 1 1 1
symmnumber: 1
zpe: 1161470.1 jmol-1
zpe.correction: 0.442381 hartree
zpe.thermalcorrener: 0.473041 hartree
zpe.thermalcorrenthalpy: 0.473985 hartree
zpe.thermalcorrgfe: 0.377084 hartree
zpe.sumelectzpe: -1735.581843 hartree
zpe.sumelectthermal: -1735.551183 hartree
zpe.sumelectthermalent: -1735.550239 hartree
zpe.sumelectthermalfe: -1735.647139 hartree
dipole: 2.5300 8.8461 -3.8054
dipole: 9.9567
quadrupole: -184.9711 -179.6283 -176.7135
quadrupole: -8.8583 23.4675 6.0955
quadrupole: -4.5335 0.8094 3.7241 -8.8583 23.4675 6.0955
hfenergy: -1736.0242239 hartree
pointgroup: C01 [X(C21H26F1N5O2S1)]
dipole: -0.7956668 3.4422853 1.6918784 debye
polarizability: 424.500741|-1.0941956|357.1907581|3.682083|-11.4284538|263.0555853 unknown
InChI: InChI=1S/C21H26FN5O2S/c1-21(2)26-19(23)25-20(24)27(21)17-11-5-9-15(13-17)7-3-4-8-16-10-6-12-18(14-16)30(22,28)29/h5-6,9-14H,3-4,7-8,23-24H2,1-2H3
charge 0 multiplicity 1
56 atoms
S  3.944914 -2.138101 -0.981875
F  5.341463 -1.592561 -2.091134
O  4.411492 -3.528041 -0.324578
O  2.614039 -2.011807 -1.875457
N  -2.916223 -0.567192 -0.191953
N  -1.967143 -2.790467 0.359614
N  -4.222541 -2.138127 1.082053
N  -5.045916 0.008229 0.691782
N  -3.199592 -4.074684 1.885986
C  -1.971152 -1.71274 -0.639089
C  0.468417 4.051145 0.622105
C  -1.064685 3.979844 0.891668
C  -2.689195 0.798212 -0.594427
C  1.20985 2.729437 0.918288
C  -1.793304 3.037355 -0.057108
C  -2.479681 -2.261948 -2.001248
C  -0.535756 -1.169078 -0.771266
C  -2.069507 1.698233 0.310248
C  2.730359 2.826054 0.60819
C  -4.048783 -0.932868 0.523129
C  -3.067824 1.252043 -1.884021
C  -2.169989 3.472138 -1.356228
C  3.463881 1.523422 0.88069
C  -2.804356 2.589459 -2.258191
C  -3.084462 -2.974907 1.05266
C  3.392115 0.455677 -0.051235
C  4.206253 1.325218 2.074885
C  4.057837 -0.737806 0.258807
C  4.860689 0.102783 2.350982
C  4.798996 -0.96574 1.42869
H  0.637231 4.340192 -0.435187
H  0.899329 4.861075 1.245378
H  -1.226719 3.663139 1.940353
H  -1.48267 5.000583 0.795454
H  1.069979 2.453407 1.983158
H  0.767985 1.909194 0.320452
H  -1.854859 -3.122759 -2.295543
H  -3.52503 -2.607181 -1.908881
H  -2.41543 -1.494896 -2.794817
H  0.122724 -2.003275 -1.061706
H  -0.460736 -0.378925 -1.538963
H  -0.184849 -0.777992 0.199844
H  -1.797875 1.329114 1.306158
H  2.854084 3.114426 -0.454109
H  3.172682 3.639228 1.215307
H  -3.560928 0.562017 -2.576508
H  -1.970666 4.508294 -1.657086
H  -3.097641 2.942619 -3.253177
H  2.825706 0.555238 -0.983831
H  4.27205 2.145196 2.799448
H  -5.834301 -0.26074 1.274492
H  -5.02895 0.903571 0.211209
H  5.425226 -0.021674 3.280412
H  5.293711 -1.924059 1.612521
H  -2.443156 -4.751506 1.919136
H  -4.024193 -4.162171 2.471519
