program: Gaussian 09
title: 000269859
version: EM64L-G09RevD.01
frameworkgroup: C1[X(C12H14O3)]
method: RPBEPBE
basis: SDD
operation: Freq
keyword: #pfreq=noraman
keyword: PBEPBE/SDD
title: #p freq=noraman PBEPBE/SDD
converged: YES YES NO NO
title: Mulliken charges:
elementType: O O O C C C C C C C C C C C C H H H H H H H H H H H H H H
charge: -0.387438 -0.162042 -0.162247 0.223012 -0.567826 0.031831 0.452664 -0.139113 -0.413642 -0.528841 0.374687 0.082096 -0.779996 -0.777575 -0.778940 0.235135 0.278001 0.273474 0.268223 0.249306 0.250652 0.227323 0.224154 0.234764 0.229175 0.233783 0.236880 0.225539 0.366962
chargesum: 0.00000
title: Mulliken charges with hydrogens summed into heavy atoms:
elementType: O O O C C C C C C C C C C C C
charge: -0.020477 -0.162042 -0.162247 0.223012 -0.054690 0.031831 0.452664 -0.139113 -0.140168 -0.260618 0.374687 0.082096 -0.052715 -0.089482 -0.082738
polarizability: 2.01359114e+02 1.34694537e+01 1.56458427e+02 6.81370653e+00 1.29817854e+00 8.61967499e+01
1716.lowfreq: -9.6150 -1.6372 -0.0008 -0.0004 0.0003 5.0829 40.2801 44.9427 67.8903
frequency: 40.2459 44.9392 67.8884 74.5318 113.8626 129.2585 139.3850 175.9479 177.1950 197.8441 250.4283 268.7839 289.6875 308.5175 351.6829 377.1983 392.0552 401.6898 419.1393 454.4234 479.2653 494.7120 549.9000 589.6149 650.6181 673.8394 691.2586 737.6672 771.0682 807.0808 857.9976 879.9381 889.2340 946.7646 954.1457 960.2362 1004.4793 1014.4307 1029.3401 1046.3036 1080.9983 1115.7178 1146.8139 1176.5286 1188.4748 1206.8692 1233.6792 1278.3119 1302.9734 1327.0455 1357.4657 1391.8403 1397.6528 1401.4419 1410.0885 1447.5254 1450.2447 1455.0614 1459.9450 1465.6863 1471.3362 1475.7160 1526.6281 1576.1039 1582.5458 1634.5283 1665.6185 2966.6593 2973.0264 2979.3884 2989.7963 3025.9408 3040.5709 3045.0398 3067.1375 3078.2582 3089.0536 3098.2009 3108.2166 3150.7569 3154.2973
redmass: 5.0646 3.0248 6.4430 3.1235 1.0902 3.9018 1.6109 1.5123 1.3278 4.5714 3.9234 2.7663 2.3539 3.8266 10.7545 4.2212 6.2146 3.0495 4.1586 2.9434 4.0811 4.1988 4.1567 4.1993 4.2170 4.8322 6.7291 1.1420 2.4845 2.8970 3.0555 1.4519 1.9119 1.5564 2.7577 2.3456 1.2529 1.6686 1.8257 1.5841 1.6712 2.1378 3.2592 1.8769 3.0573 2.1163 1.8133 1.8378 1.5521 3.1152 1.4953 1.2832 1.2431 1.2710 2.3435 1.0459 1.0870 1.0545 1.1194 1.0554 1.0570 1.0826 12.0406 11.1157 7.2298 6.6237 5.9770 1.0375 1.0388 1.0593 1.0369 1.0983 1.0969 1.0962 1.0955 1.0903 1.0975 1.0970 1.1009 1.0897 1.0703
irintensity: 0.4711 0.2291 0.3700 1.4022 0.4400 3.6200 0.0063 2.0532 3.5268 6.2238 5.5336 1.2470 0.5897 3.8739 4.2122 3.8404 8.3696 1.1318 9.7129 2.7246 2.0958 5.5879 2.1985 2.8382 6.6810 0.3500 4.3033 93.9447 3.4898 6.3167 3.3991 17.4399 13.6896 0.7065 12.8722 16.7303 14.8778 28.1874 3.0002 11.7521 4.3121 33.3437 6.4893 4.6630 92.9921 8.3512 18.0032 58.6110 58.9796 7.5739 7.4489 31.1541 45.2288 3.6325 90.8579 15.9774 15.1549 0.3359 42.5228 19.1370 25.2319 9.5100 261.2869 60.0561 24.4732 1.6608 13.0935 30.3237 38.8892 18.0089 6.6335 6.4377 5.6176 26.1768 8.3661 14.1338 31.7645 26.5707 22.3740 115.3871 555.1863
temp: 298.150 k
press: 1.00000 atm
elementType: 8 8 8 6 6 6 6 6 6 6 6 6 6 6 6 1 1 1 1 1 1 1 1 1 1 1 1 1 1
symmnumber: 1
zpe: 602294.5 jmol-1
zpe.correction: 0.229402 hartree
zpe.thermalcorrener: 0.245157 hartree
zpe.thermalcorrenthalpy: 0.246102 hartree
zpe.thermalcorrgfe: 0.185918 hartree
zpe.sumelectzpe: -690.194727 hartree
zpe.sumelectthermal: -690.178971 hartree
zpe.sumelectthermalent: -690.178027 hartree
zpe.sumelectthermalfe: -690.238211 hartree
dipole: 6.0503 4.9879 0.3634
dipole: 7.8497
quadrupole: -89.2448 -98.6011 -86.5576
quadrupole: -16.6103 -0.4803 -1.6006
quadrupole: 2.2230 -7.1333 4.9103 -16.6103 -0.4803 -1.6006
hfenergy: -690.4241287 hartree
pointgroup: C01 [X(C12H14O3)]
dipole: -2.1003919 2.0410448 0.9798153 debye
polarizability: 197.2320428|-18.740364|145.6323287|-5.1633189|30.1446992|101.1499201 unknown
InChI: InChI=1S/C12H14O3/c1-7(2)4-5-9-11(14)8(3)6-10(13)12(9)15/h4,6,14H,5H2,1-3H3
charge 0 multiplicity 1
29 atoms
O  -0.383931 1.710848 0.563937
O  1.080851 -2.443486 -1.424035
O  3.746493 -1.6598 -0.88964
C  0.239052 -0.409708 -0.46167
C  -1.198729 -0.80402 -0.783033
C  0.571501 0.791861 0.153556
C  1.962408 1.231656 0.422067
C  1.312349 -1.327917 -0.860379
C  -2.198308 -0.469555 0.314129
C  3.004608 0.41055 0.063746
C  -3.403169 0.174252 0.190677
C  2.786369 -0.897826 -0.575721
C  2.16866 2.573176 1.080004
C  -4.315078 0.346567 1.394532
C  -3.952509 0.733315 -1.110154
H  -1.498635 -0.345561 -1.745522
H  -1.192716 -1.897002 -0.96403
H  -1.933456 -0.865674 1.307094
H  4.044445 0.702698 0.244971
H  1.650121 2.615762 2.055034
H  1.728069 3.381838 0.468444
H  3.240257 2.779531 1.231234
H  -4.551906 1.41454 1.568244
H  -3.867585 -0.065015 2.315135
H  -5.282188 -0.166368 1.224601
H  -3.229205 0.707481 -1.940618
H  -4.843448 0.154202 -1.423614
H  -4.28895 1.779422 -0.976202
H  -1.30477 1.295735 0.501714
