program: Gaussian 09
title: 000025876
version: EM64L-G09RevD.01
frameworkgroup: C1[X(C22H28N2O)]
method: RPBEPBE
basis: SDD
operation: Freq
keyword: #p
keyword: freq=noraman
keyword: PBEPBE/SDD
title: #p freq=noraman PBEPBE/SDD
converged: NO YES NO NO
title: Mulliken charges:
elementType: O N N C C C C C C C C C C C C C C C C C C C C C C H H H H H H H H H H H H H H H H H H H H H H H H H H H H
charge: -0.246272 -0.109282 -0.017447 0.275123 -0.465865 -0.097982 -0.461401 0.305982 -0.359858 -0.725946 -0.744601 0.168150 -0.339441 -0.338042 -0.327827 -0.367097 -0.327190 -0.319863 0.393429 -0.275339 -0.366284 -0.482925 -0.443742 -0.303134 -0.254235 0.223079 0.245974 0.222877 0.229715 0.236285 0.201106 0.198599 0.235784 0.212108 0.239700 0.225904 0.216586 0.244955 0.198105 0.227341 0.209372 0.191346 0.256005 0.194786 0.214836 0.213743 0.187619 0.232224 0.223205 0.242633 0.241503 0.231070 0.234627
chargesum: 0.00000
title: Mulliken charges with hydrogens summed into heavy atoms:
elementType: O N N C C C C C C C C C C C C C C C C C C C C C C
charge: -0.246272 -0.109282 -0.017447 0.275123 0.003188 0.124895 0.004599 0.305982 0.039847 -0.038355 -0.057155 0.168150 0.086005 0.062676 -0.327827 -0.111092 0.082432 0.081500 0.393429 -0.043115 -0.143079 -0.240292 -0.202239 -0.072064 -0.019607
polarizability: 2.42912409e+02 -1.62014476e+01 2.76853275e+02 -4.24811068e+01 5.79779056e+00 2.16851169e+02
1716.lowfreq: -5.5313 -0.0007 -0.0006 -0.0001 5.9203 9.2069 15.6412 26.9447 34.0010
frequency: 15.0168 26.4381 33.9422 49.3177 53.6745 63.9267 76.7636 97.9137 129.3203 142.3013 153.5732 172.0074 183.6270 203.1880 215.7672 226.8968 233.7920 243.6637 260.9571 274.5669 306.4473 312.6621 317.2311 332.8666 372.2847 396.0736 415.8955 423.3661 429.0411 440.1880 445.2485 470.0723 473.8567 513.3967 523.2076 527.9393 569.7908 584.4620 609.8949 632.2822 651.1604 681.4640 723.4009 747.5363 763.9053 785.7864 787.3805 796.9986 808.4722 815.8462 841.4145 855.2042 877.9021 887.8747 891.7265 905.9939 919.5946 927.0389 938.7760 955.2219 961.8457 970.5446 988.3940 994.8092 1002.5577 1021.7660 1028.0197 1030.4015 1041.6822 1050.9884 1069.3743 1083.3044 1088.5272 1098.2036 1108.0394 1119.2815 1134.2921 1141.5101 1150.5046 1163.8560 1175.0302 1180.4216 1183.3786 1190.7521 1207.5977 1229.6072 1236.5201 1243.3762 1261.7474 1268.1214 1275.0663 1283.0063 1293.5029 1302.4533 1310.5504 1323.3927 1328.1472 1342.7131 1356.7533 1363.6702 1370.5664 1371.0151 1382.7594 1387.0696 1398.4443 1401.7634 1406.2404 1440.9361 1441.9153 1446.8540 1450.0235 1454.9031 1457.7544 1467.7656 1470.3683 1473.1225 1475.0113 1482.6580 1487.7434 1489.5941 1518.8816 1585.3337 1601.4308 1629.8364 2173.3077 2851.4960 2857.6481 2870.6281 2949.2858 2954.7090 2979.2284 2982.3492 2991.2348 3004.5788 3009.8859 3023.6794 3025.5178 3044.1585 3050.4793 3070.2566 3077.3133 3078.3039 3081.4580 3083.4773 3087.2222 3087.6689 3122.2839 3126.5735 3133.7157 3143.1785 3158.9528 3161.8487 3199.2636
redmass: 4.1776 3.2472 5.0824 3.5858 3.2311 3.7993 4.4477 4.5169 4.8986 7.2359 3.9152 3.8451 3.7070 1.1001 1.4210 2.2241 2.3876 1.9760 3.2392 2.7824 3.0398 2.8013 3.3242 2.2319 3.1193 2.0099 4.4105 3.2023 4.5649 3.4084 3.6552 2.8211 3.2744 3.9626 6.2469 6.6238 3.3691 1.9458 3.2508 4.7633 4.1463 3.7522 1.9337 1.3043 2.6115 4.4618 2.4129 2.5151 3.0501 1.6493 1.5981 2.6817 1.7993 1.9845 2.5416 2.4285 1.1676 1.4855 2.4705 1.4643 1.4171 2.4237 1.3405 1.3838 3.2149 3.6126 2.1383 2.2497 2.4880 2.0815 2.4364 2.3773 2.4727 2.5197 2.4918 1.9656 2.5959 2.0491 1.8558 1.8869 1.2835 1.8505 1.4558 1.0886 1.5104 1.2974 1.8841 1.7167 1.3762 1.5837 1.4524 1.1904 1.2188 1.3743 1.3095 1.3346 1.2890 1.2247 1.4723 1.4317 2.2294 1.2776 1.2138 1.4147 3.1008 1.2064 3.6321 1.7124 1.2913 1.0825 1.0977 2.1670 1.1068 1.0608 1.0482 1.0727 1.0921 1.0715 1.0769 1.0496 3.6369 7.0049 5.3294 6.4310 12.6508 1.0705 1.0710 1.0688 1.0667 1.0666 1.0359 1.0364 1.0612 1.0885 1.0653 1.0896 1.0833 1.0952 1.0896 1.0996 1.0985 1.0960 1.0992 1.0970 1.0986 1.0992 1.0868 1.0867 1.0906 1.0912 1.0985 1.0986 1.0914
irintensity: 0.3777 0.1284 0.2425 0.9906 0.3093 0.3393 1.2035 2.0818 2.6890 2.9480 0.4532 1.2253 2.1825 0.0770 0.3496 0.9653 0.5372 2.0423 1.4200 4.8239 7.3392 2.6621 1.6771 2.6525 2.0553 1.1848 1.9412 0.7518 1.0160 11.4314 0.8695 0.9600 1.4881 0.8155 0.3742 0.3759 6.1681 8.7537 0.5381 1.7747 1.3480 0.8751 9.3805 14.0383 1.6724 2.7361 50.0945 37.8365 5.2018 59.8285 0.0422 0.7888 5.7058 1.5193 1.6520 12.8055 4.8780 1.0899 14.3377 0.6350 6.2135 16.3244 1.3932 1.5210 0.7116 1.7881 13.8013 11.9721 2.6461 26.1833 7.0772 0.5716 39.5409 4.1749 5.1621 14.3535 31.7825 9.7362 7.3287 12.1091 5.3439 0.8674 3.5099 3.4774 4.9385 15.7087 4.7627 0.2194 19.7401 4.4928 16.6671 2.1108 1.0871 0.7901 2.9703 10.0257 7.0579 11.4071 4.1353 1.1347 8.1145 0.9935 16.0691 3.9250 4.9975 24.1605 8.7525 6.6142 1.6047 1.5397 15.2810 0.5005 2.1147 2.9207 0.0189 7.9262 7.2331 14.8490 6.6749 13.5105 12.9055 3.7768 5.1156 0.3468 8.0541 35.0015 43.6777 204.4781 40.7737 95.8050 23.4871 23.9961 12.6122 14.5620 20.6241 44.3841 7.3811 31.4145 39.0399 0.6300 45.1113 44.1773 33.8927 30.3890 52.5133 16.5871 0.9491 2.2838 15.1307 12.5805 32.9363 19.4839 12.0055
temp: 298.150 k
press: 1.00000 atm
elementType: 8 7 7 6 6 6 6 6 6 6 6 6 6 6 6 6 6 6 6 6 6 6 6 6 6 1 1 1 1 1 1 1 1 1 1 1 1 1 1 1 1 1 1 1 1 1 1 1 1 1 1 1 1
symmnumber: 1
zpe: 1181856.4 jmol-1
zpe.correction: 0.450145 hartree
zpe.thermalcorrener: 0.474230 hartree
zpe.thermalcorrenthalpy: 0.475174 hartree
zpe.thermalcorrgfe: 0.395462 hartree
zpe.sumelectzpe: -1037.965858 hartree
zpe.sumelectthermal: -1037.941773 hartree
zpe.sumelectthermalent: -1037.940828 hartree
zpe.sumelectthermalfe: -1038.020541 hartree
dipole: -0.7154 1.8239 1.3450
dipole: 2.3764
quadrupole: -167.6552 -149.0524 -146.1573
quadrupole: 18.4527 1.7782 -8.5413
quadrupole: -13.3669 5.2359 8.1310 18.4527 1.7782 -8.5413
hfenergy: -1038.4160029 hartree
pointgroup: C01 [X(C22H28N2O1)]
dipole: -0.3280239 0.7300855 0.4832356 debye
polarizability: 244.7907837|-21.2764599|274.5228145|-41.6344646|-0.9629295|217.3032551 unknown
InChI: InChI=1S/C22H28N2O/c1-18(2)22(17-23,11-6-12-24-13-15-25-16-14-24)21-10-5-8-19-7-3-4-9-20(19)21/h3-5,7-10,18H,6,11-16H2,1-2H3
charge 0 multiplicity 1
53 atoms
O  -5.16566 0.295959 0.363103
N  -2.834513 -1.301765 -0.344724
N  3.022868 -3.086421 -1.047998
C  1.607466 -1.230953 0.271338
C  0.121805 -1.761705 0.194615
C  2.179371 -1.243257 1.763999
C  -0.496443 -1.718894 -1.217987
C  1.762135 0.17835 -0.377411
C  -1.977772 -2.155649 -1.209147
C  3.662329 -0.803485 1.806078
C  2.005045 -2.610925 2.464968
C  1.061955 1.355085 0.119064
C  -3.029897 0.067549 -0.892312
C  -4.15474 -1.929987 -0.074638
C  2.411521 -2.229109 -0.485685
C  2.612651 0.326549 -1.48366
C  -3.858456 0.914537 0.085863
C  -4.964652 -1.059969 0.899939
C  1.279976 2.631049 -0.551388
C  2.819994 1.57906 -2.134149
C  0.152385 1.362777 1.23614
C  2.16431 2.716544 -1.675015
C  0.608504 3.811944 -0.088462
C  -0.487573 2.528348 1.663874
C  -0.261021 3.771879 1.000111
H  0.109444 -2.808088 0.553056
H  -0.528337 -1.189211 0.875635
H  1.593146 -0.494085 2.326705
H  -0.40155 -0.705451 -1.650031
H  0.058497 -2.397017 -1.895866
H  -2.046344 -3.191247 -0.820638
H  -2.358175 -2.179042 -2.262519
H  4.306009 -1.525198 1.26944
H  4.009431 -0.757253 2.854203
H  3.811037 0.192362 1.353812
H  0.944628 -2.886679 2.597833
H  2.464347 -2.570026 3.469573
H  2.507142 -3.419136 1.901562
H  -3.548817 0.03371 -1.884192
H  -2.048308 0.552878 -1.036657
H  -3.992227 -2.929794 0.371657
H  -4.745764 -2.064534 -1.016301
H  3.145289 -0.548235 -1.869862
H  -3.293383 1.039424 1.034907
H  -4.085465 1.905145 -0.341311
H  -5.976798 -1.469954 1.053372
H  -4.433536 -1.001779 1.875156
H  3.497587 1.631338 -2.992717
H  -0.06233 0.439725 1.774788
H  2.312269 3.688043 -2.160987
H  0.796799 4.755637 -0.614421
H  -1.169589 2.487085 2.52048
H  -0.767191 4.679768 1.344903
