program: Gaussian 09
title: 000277166
version: EM64L-G09RevD.01
frameworkgroup: C1[X(C10H10N2O)]
method: RPBEPBE
basis: SDD
operation: Freq
keyword: #p
keyword: freq=noraman
keyword: PBEPBE/SDD
title: #p freq=noraman PBEPBE/SDD
converged: YES YES NO NO
title: Mulliken charges:
elementType: O N N C C C C C C C C C C H H H H H H H H H H
charge: -0.455492 -0.266361 -0.111529 0.416346 0.187493 -0.197346 -0.434643 -0.366582 -0.376543 -0.338833 -0.225097 -0.216356 -0.241252 0.267342 0.238632 0.245436 0.317332 0.253408 0.253531 0.235191 0.231898 0.233850 0.349573
chargesum: 0.00000
title: Mulliken charges with hydrogens summed into heavy atoms:
elementType: O N N C C C C C C C C C C
charge: -0.105919 -0.266361 -0.111529 0.416346 0.187493 0.069996 0.049425 -0.049250 -0.123135 -0.085301 0.010094 0.015542 -0.007402
polarizability: 1.68093249e+02 -7.44294066e+00 1.27805040e+02 -2.73172922e+00 -3.63675978e+00 6.42325101e+01
1716.lowfreq: -7.8023 -7.6363 -0.0012 -0.0011 -0.0010 5.8522 65.8208 96.4957 109.4036
frequency: 65.8140 96.4880 109.4031 140.5180 151.4705 263.5483 300.5426 335.4620 368.2956 413.2665 430.0216 468.9513 523.9693 611.5180 634.7166 656.9855 683.4291 703.9224 745.9467 763.1845 769.7883 849.0559 857.0802 893.7002 898.4666 933.9705 942.8335 983.4402 984.8905 988.2201 1008.3401 1032.7015 1084.3693 1086.8255 1108.8376 1171.9109 1174.8446 1187.8960 1198.0264 1289.0664 1291.2334 1313.4141 1339.0154 1370.9361 1382.2787 1393.8818 1442.4945 1454.6289 1463.8973 1486.5813 1496.2766 1595.2887 1613.7887 3025.1716 3102.5343 3122.0785 3133.5687 3143.9670 3155.3208 3170.2702 3228.2568 3257.3191 3556.1373
redmass: 3.8897 4.9271 5.2456 3.9114 5.5616 2.8555 4.4170 5.3016 1.4617 2.9587 2.2532 4.9026 3.3720 5.9281 3.5530 5.5103 5.9508 2.2420 1.4456 3.8167 1.6276 1.3833 1.2533 3.0211 6.5213 1.3838 2.4002 4.2814 1.3804 5.4041 1.3420 1.8988 1.6274 1.7536 1.5275 1.5142 1.0913 2.7117 1.1459 2.6335 2.3449 1.3402 1.4404 1.3323 7.2926 2.8466 2.2179 1.2869 3.4358 3.5132 3.2925 6.4874 5.8272 1.0613 1.1035 1.0919 1.0864 1.0912 1.0960 1.1015 1.0913 1.1083 1.0663
irintensity: 0.6123 0.1328 4.3836 5.1921 2.5149 1.5824 6.0991 3.7028 96.3965 0.3326 92.9981 2.8957 16.7103 0.1205 3.8812 10.9658 4.9954 36.7477 72.8739 31.9921 67.5091 8.4588 0.9050 86.0190 4.2601 8.2283 16.2253 1.6106 0.7303 0.8386 3.5020 9.2882 4.1088 16.1041 22.7996 27.9255 1.2635 15.9971 0.6555 10.0242 56.8809 8.3849 1.9983 18.6115 0.2406 54.6715 7.6524 23.1954 27.2449 49.2692 59.8486 3.7749 33.3082 35.2428 10.8811 16.0404 4.7793 3.0144 22.6430 23.7555 4.1697 2.2340 8.9263
temp: 298.150 k
press: 1.00000 atm
elementType: 8 7 7 6 6 6 6 6 6 6 6 6 6 1 1 1 1 1 1 1 1 1 1
symmnumber: 1
zpe: 475216.9 jmol-1
zpe.correction: 0.181001 hartree
zpe.thermalcorrener: 0.191731 hartree
zpe.thermalcorrenthalpy: 0.192675 hartree
zpe.thermalcorrgfe: 0.144217 hartree
zpe.sumelectzpe: -570.845425 hartree
zpe.sumelectthermal: -570.834695 hartree
zpe.sumelectthermalent: -570.833751 hartree
zpe.sumelectthermalfe: -570.882208 hartree
dipole: -2.6482 -1.2492 -0.2448
dipole: 2.9382
quadrupole: -74.5710 -71.4469 -77.0778
quadrupole: 1.8301 -3.0010 -0.4460
quadrupole: -0.2058 2.9184 -2.7126 1.8301 -3.0010 -0.4460
hfenergy: -571.0264259 hartree
pointgroup: C01 [X(C10H10N2O1)]
dipole: -1.0438472 0.3257868 -0.3749081 debye
dipolederiv: -0.3023889 0.1627857 -0.0552074 0.2839311 -0.574835 0.0875939 -0.1104133 0.226207 -0.8773795 -1.1162211 -0.1752402 0.0779309 -0.1819994 -0.0520123 0.0260712 0.1563831 0.0255948 -0.0614566 -0.7149127 -0.0372202 0.0194931 -0.2458842 -0.2830866 -0.0109304 0.0553829 0.0017787 -0.2433231 0.9952405 0.1589404 -0.0342995 0.2333192 0.0440519 -0.0205077 -0.1360981 0.0064017 0.1286636 0.8376692 0.0039809 0.0215661 -0.1172356 -0.1117175 0.0728186 0.2161655 -0.0605358 -0.0932277 0.2473817 0.0500712 -0.0252559 0.3057187 -0.075449 -0.0068058 -0.3239454 -0.0539048 -0.1658924 0.2210381 -0.0383469 0.0325118 -0.1439218 0.4756021 -0.0646509 0.0371815 -0.0879113 0.7115225 -0.2298884 -0.0179482 0.034827 -0.060696 -0.1430271 -0.010859 0.103509 0.005066 -0.0854589 -0.2212578 0.0008516 -0.0249188 0.030661 -0.1385506 -0.0435177 -0.080843 -0.050499 -0.006025 -0.1279894 0.095501 -0.0875291 0.1580946 0.0365034 -0.1167001 -0.060347 -0.1248026 -0.112067 0.037473 0.0463192 -0.04611 0.0393114 -0.1025246 -0.0930384 -0.0741219 -0.0901219 0.1039742 0.0330103 0.0001517 0.0739353 -0.0038219 -0.1236122 -0.0640449 0.1136008 -0.0561813 0.067561 0.0263036 0.0374436 -0.0152961 0.038534 -0.1455352 -0.0258332 -0.0364158 -0.0286545 -0.1021698 0.0557383 0.0791119 -0.0441548 0.0525689 0.0964266 0.0617591 -0.0276569 0.0662748 0.1713687 0.0235065 -0.1408161 -0.0372697 -0.0948846 0.038666 -0.019564 -0.0313267 0.0150009 -0.0047332 -0.0810903 0.1419597 0.0366659 0.0585476 0.0349079 -0.0169165 0.0301747 -0.015143 -0.0054549 0.1710178 -0.0309333 -0.0158066 -0.0528727 0.1502421 0.0105236 -0.0100733 0.0002496 0.0942292 0.070388 -0.0393004 0.0748633 -0.0218272 0.1313496 0.0687367 0.0716679 0.0579558 -0.0145091 0.0337877 -0.0822782 0.0493097 -0.0399806 0.0544983 0.0850326 0.0519054 0.0861957 0.1357011 0.0490514 -0.0299265 0.0485058 -0.0366514 0.1227129 0.0781586 0.0748794 0.0776897 -0.0502598 -0.0066465 0.0076898 -0.091853 0.0127479 0.1419935 0.0487379 -0.1108246 0.0444628 -0.0225529 -0.119415 -0.0466329 0.017446 -0.0474725 0.1475548 0.0294882 0.0186682 0.0252864 0.0981048 0.1182041 -0.1461638 -0.0093541 -0.1661867 0.2758411 -0.0755518 0.0725474 -0.0704095 0.3333845 unknown
polarizability: 167.2967517|12.3435359|85.9338901|0.1591185|-29.6833185|106.9001571 unknown
InChI: InChI=1S/C10H10N2O/c13-8-10-11-6-7-12(10)9-4-2-1-3-5-9/h1-7,13H,8H2
charge 0 multiplicity 1
23 atoms
O  1.450455 -1.372036 2.265416
N  0.623173 0.389912 -0.447695
N  2.890322 0.235157 -0.355286
C  -0.777574 0.100874 -0.283961
C  1.729505 -0.353739 0.015477
C  1.142152 1.494056 -1.145874
C  1.660978 -1.617521 0.814052
C  -1.268335 -0.395855 0.948813
C  -1.664007 0.33911 -1.363853
C  2.530092 1.383323 -1.072868
C  -2.648513 -0.660282 1.08614
C  -3.042726 0.086122 -1.206861
C  -3.541095 -0.416678 0.017544
H  0.49677 2.2539 -1.577005
H  0.807776 -2.249424 0.521738
H  2.603753 -2.169371 0.648834
H  -0.578039 -0.564106 1.7841
H  -1.273043 0.694837 -2.323079
H  3.281921 2.053206 -1.482676
H  -3.025346 -1.046575 2.039309
H  -3.724167 0.270239 -2.044392
H  -4.611204 -0.617244 0.135506
H  2.215555 -0.836106 2.598021
