program: Gaussian 09
title: 000269836
version: EM64L-G09RevD.01
frameworkgroup: C1[X(C20H18O2S)]
method: RPBEPBE
basis: SDD
operation: Freq
keyword: #p
keyword: freq=noraman
keyword: PBEPBE/SDD
title: #p freq=noraman PBEPBE/SDD
converged: YES YES NO NO
title: Mulliken charges:
elementType: S O O C C C C C C C C C C C C C C C C C C C C H H H H H H H H H H H H H H H H H H
charge: 0.836122 -0.549769 -0.534637 -0.609277 0.567339 -0.268780 -0.568724 0.491584 -0.380728 -0.013338 -0.248490 -0.228439 -0.242020 -0.426011 -0.409664 -0.237993 -0.269714 -0.230218 -0.232606 -0.208369 -0.225029 -0.244313 -0.217334 0.228913 0.250203 0.213388 0.262556 0.244422 0.303783 0.234100 0.242537 0.228009 0.283511 0.274893 0.289590 0.221577 0.224968 0.240862 0.243717 0.225515 0.237863
chargesum: 0.00000
title: Mulliken charges with hydrogens summed into heavy atoms:
elementType: S O O C C C C C C C C C C C C C C C C C C C C
charge: 0.836122 -0.549769 -0.534637 -0.130161 0.567339 -0.268780 -0.092780 0.491584 -0.136306 -0.013338 0.055292 0.005661 0.000516 -0.198003 -0.126153 0.036900 0.019876 -0.008642 -0.007637 0.032494 0.018688 -0.018797 0.020529
polarizability: 2.86898175e+02 2.85069318e+01 2.63736923e+02 1.49363272e+01 -8.01906602e+00 1.68736299e+02
1716.lowfreq: 0.0007 0.0011 0.0015 4.5336 6.5261 10.8100 18.5868 34.4524 37.8748
frequency: 18.2421 34.3824 37.8062 45.5418 54.4863 68.3218 92.0181 106.7652 136.0172 150.6677 174.6488 196.9232 220.3634 242.4515 253.9163 269.2966 301.0149 327.2562 352.7100 384.4823 404.5268 406.5931 419.7251 432.2310 469.0083 502.9494 507.7543 530.5638 545.1859 603.4071 607.5645 617.9855 642.6252 659.0419 692.5714 710.2083 732.1542 760.7929 761.6830 774.7194 782.2163 786.3353 793.0722 846.4784 852.2541 862.8088 894.1531 914.3503 927.9207 935.5105 972.9502 978.6356 982.9391 984.0737 986.9896 989.3576 990.7330 994.6544 1002.5507 1005.1372 1006.2925 1008.8685 1027.8676 1039.7305 1049.2666 1075.3333 1078.3619 1115.6071 1159.6230 1171.1549 1173.8637 1175.0497 1178.6776 1188.4807 1210.6877 1218.8107 1262.2138 1270.4852 1291.8279 1302.8799 1324.9906 1333.3079 1375.9713 1382.6994 1384.0973 1425.2526 1435.0822 1441.7080 1454.4884 1459.3066 1475.6720 1484.5636 1488.3848 1566.9324 1578.5553 1591.9535 1603.6404 1607.3747 1613.5129 2999.2958 3008.3408 3064.5070 3087.7855 3110.4567 3115.4498 3125.6227 3128.5997 3136.4572 3138.6106 3140.6586 3145.0583 3148.7674 3153.4230 3159.2457 3163.0517 3168.1425 3173.7865
redmass: 5.7342 4.4096 4.5723 4.7915 4.5237 4.6306 3.7244 4.8879 6.4447 5.5287 5.2301 6.4738 5.2442 8.0342 6.5129 4.7895 4.3032 3.0735 3.4135 7.8291 2.8761 2.8665 3.4002 5.7182 3.9489 3.7899 4.8394 5.9689 3.5938 6.4728 4.8515 6.3235 6.5939 7.0326 2.3578 1.8447 3.9362 1.8049 1.4871 1.3539 1.7613 2.5063 5.4229 2.6349 1.2786 1.2669 1.4950 12.2467 1.5148 1.3670 1.4824 5.3893 1.4629 1.4002 1.8808 4.1320 4.6894 2.1736 1.3838 1.5144 1.6377 4.1193 2.1941 2.0912 2.0993 1.6007 1.5496 1.5391 1.1541 1.0524 1.0565 1.0638 1.1224 1.1237 2.3566 2.5535 1.3835 1.3549 1.2885 1.3044 1.3116 1.2394 5.6788 7.4148 8.4246 2.2327 2.2364 2.1681 2.0294 2.5015 1.1863 2.0656 1.1021 5.8234 5.8346 6.0331 6.8941 7.1118 6.0606 1.0605 1.0653 1.0968 1.1010 1.0869 1.0876 1.0874 1.0909 1.0856 1.0884 1.0957 1.0884 1.0938 1.0925 1.1014 1.0967 1.1004 1.1015
irintensity: 0.7210 0.6177 0.7625 1.0976 0.5920 0.6693 0.7280 0.2099 2.9008 1.2464 1.1358 2.8345 0.8103 7.6715 2.3081 1.9865 2.0865 2.8970 1.3275 11.6372 0.1918 0.1115 8.5187 26.8981 14.6430 43.9151 97.8190 23.3023 6.6523 0.0209 0.0596 0.7586 0.6009 10.2690 33.1097 51.9848 4.6910 13.6551 73.8515 128.9101 8.4504 15.2674 9.7509 1.3102 1.5263 1.6466 2.6749 103.7310 3.9941 1.4878 1.4624 2.3534 0.4039 0.4723 0.3472 0.0496 0.0925 3.4194 0.1163 0.0555 1.0309 0.9639 7.7724 8.8526 21.6133 7.9765 3.7007 0.2799 3.4539 0.0384 0.0288 3.9923 5.9289 0.7481 9.8736 0.8538 3.5363 16.1222 2.1788 3.2901 0.9928 0.6262 6.5479 0.6734 4.9910 5.3329 15.3639 6.4021 14.7312 31.0375 5.4453 25.8205 10.5343 0.9235 3.4562 1.5974 1.4240 5.3937 10.6974 19.3877 23.6129 1.6524 14.4952 9.8119 0.4279 4.3767 7.9927 1.1849 12.6997 38.8989 7.6390 2.8312 1.8250 35.6344 5.6897 32.5305 26.6213
temp: 298.150 k
press: 1.00000 atm
elementType: 16 8 8 6 6 6 6 6 6 6 6 6 6 6 6 6 6 6 6 6 6 6 6 1 1 1 1 1 1 1 1 1 1 1 1 1 1 1 1 1 1
symmnumber: 1
zpe: 842957.9 jmol-1
zpe.correction: 0.321066 hartree
zpe.thermalcorrener: 0.341562 hartree
zpe.thermalcorrenthalpy: 0.342506 hartree
zpe.thermalcorrgfe: 0.269682 hartree
zpe.sumelectzpe: -1319.656155 hartree
zpe.sumelectthermal: -1319.635659 hartree
zpe.sumelectthermalent: -1319.634715 hartree
zpe.sumelectthermalfe: -1319.707539 hartree
dipole: 0.9944 0.2032 -6.1530
dipole: 6.2361
quadrupole: -133.2746 -118.9592 -153.9506
quadrupole: 2.2000 -6.2678 0.0788
quadrupole: 2.1202 16.4356 -18.5558 2.2000 -6.2678 0.0788
hfenergy: -1319.9772207 hartree
pointgroup: C01 [X(C20H18O2S1)]
dipole: 0.554168 0.2042629 -2.3813276 debye
polarizability: 277.8993726|29.8231782|270.0745627|24.6411023|-0.7491543|171.397461 unknown
InChI: InChI=1S/C20H18O2S/c21-23(22,19-12-5-2-6-13-19)20-14-8-7-11-18(20)16-15-17-9-3-1-4-10-17/h1-14H,15-16H2
charge 0 multiplicity 1
41 atoms
S  1.520105 -0.009038 1.498732
O  0.027238 -0.442517 2.019567
O  2.748788 0.226467 2.557525
C  -0.79514 0.948201 -0.712881
C  0.378875 1.87358 -0.44567
C  1.424126 1.617152 0.47252
C  -2.013597 1.262423 0.219467
C  -3.126071 0.241927 0.038066
C  0.448373 3.129803 -1.11055
C  2.093204 -1.364082 0.293379
C  2.463702 2.516566 0.763778
C  1.481783 4.05577 -0.854341
C  2.492509 3.755713 0.087946
C  -4.197862 0.470199 -0.862138
C  -3.085311 -0.985765 0.752497
C  3.457063 -1.411979 -0.03794
C  1.14639 -2.300499 -0.149159
C  -5.207187 -0.502444 -1.048803
C  -4.09344 -1.958289 0.569076
C  3.88602 -2.447442 -0.900274
C  1.595487 -3.33216 -1.006654
C  -5.157046 -1.72139 -0.334017
C  2.956865 -3.399036 -1.385422
H  -1.116021 1.053449 -1.766357
H  -0.519353 -0.108245 -0.563089
H  -2.376492 2.284272 -0.001479
H  -1.651832 1.244361 1.262177
H  -0.332667 3.372025 -1.841308
H  3.212865 2.242181 1.514994
H  1.497885 5.012891 -1.387048
H  3.291596 4.473926 0.297811
H  -4.247417 1.418692 -1.412617
H  -2.263866 -1.15923 1.459586
H  4.161531 -0.685663 0.380176
H  0.106481 -2.241566 0.190142
H  -6.032682 -0.308418 -1.74354
H  -4.055854 -2.896047 1.135673
H  4.941854 -2.515054 -1.182408
H  0.884386 -4.081354 -1.369657
H  -5.941405 -2.474254 -0.47295
H  3.297517 -4.201125 -2.049111
