program: Gaussian 09
title: 000277170
version: EM64L-G09RevD.01
frameworkgroup: C1[X(C13H14N2O2)]
method: RPBEPBE
basis: SDD
operation: Freq
keyword: #p
keyword: freq=noraman
keyword: PBEPBE/SDD
title: #p freq=noraman PBEPBE/SDD
converged: YES YES NO NO
title: Mulliken charges:
elementType: O O N N C C C C C C C C C C C C C H H H H H H H H H H H H H H
charge: -0.213700 -0.226759 -0.457176 -0.400725 -0.096076 0.042095 -0.495237 -0.486392 -0.437476 0.485726 0.165143 0.147499 -0.421588 -0.362671 -0.224955 -0.250503 -0.240689 0.265486 0.243421 0.223505 0.189409 0.247289 0.230167 0.218785 0.320746 0.348417 0.240422 0.257626 0.228347 0.228197 0.231667
chargesum: 0.00000
title: Mulliken charges with hydrogens summed into heavy atoms:
elementType: O O N N C C C C C C C C C C C C C
charge: -0.213700 -0.226759 -0.136431 -0.052309 0.169411 0.042095 -0.028311 -0.049694 0.011477 0.485726 0.165143 0.147499 -0.181166 -0.105045 0.003392 -0.022306 -0.009022
polarizability: 1.79188467e+02 1.15203204e+01 1.31298450e+02 2.02927784e+00 1.53619833e+01 1.39412573e+02
1716.lowfreq: -5.4451 -5.0586 0.0005 0.0006 0.0007 13.7768 32.7384 54.6005 56.6027
frequency: 32.0445 54.5829 56.4665 89.2368 105.3149 116.6476 163.7279 178.0364 228.1980 272.8666 297.0799 318.1130 350.4302 397.5746 402.4319 477.1092 500.3103 533.5547 592.3992 605.8350 615.5875 619.9844 653.8801 677.3297 695.6835 705.2839 728.2176 744.8200 763.5673 776.9841 835.3790 852.0892 892.7385 914.0201 924.3012 938.8556 958.6929 968.5744 976.4889 978.5692 989.6557 998.0953 1027.6682 1036.7974 1056.3961 1084.3119 1114.3421 1150.6401 1174.5416 1175.3530 1195.6272 1197.2114 1201.4185 1215.9230 1216.5886 1236.6140 1248.4132 1251.3468 1307.9576 1313.3459 1322.2185 1329.8647 1358.5436 1381.3521 1434.9821 1453.3120 1461.3310 1478.5855 1481.1681 1591.6370 1609.9938 1677.8454 1720.2130 3002.0167 3015.5092 3026.0514 3039.8677 3083.6918 3088.6819 3107.5272 3126.8618 3135.5486 3148.5667 3156.5542 3168.1895 3585.9448 3608.3238
redmass: 3.9076 7.6540 3.4789 2.9158 3.4704 4.2440 7.8013 3.0451 4.2716 5.2148 5.1532 4.2621 5.4985 7.3186 2.8402 1.2671 3.4615 2.1071 3.8824 6.3396 6.2216 4.8554 1.5232 2.7131 3.4983 1.8684 6.3912 2.7452 1.7585 1.2222 2.4036 1.2498 2.4003 2.7537 1.7908 2.7356 1.2779 3.4627 1.3968 2.9854 5.0347 1.3787 2.5415 2.1353 2.8606 1.6885 3.0416 3.2492 1.1946 1.1926 1.1742 2.9436 1.9812 1.4150 1.4820 1.3986 1.5223 1.4085 2.3215 2.1578 1.3834 1.8183 1.7202 7.6602 2.2307 1.0894 1.0845 1.1345 2.1632 6.1306 6.0206 8.6560 9.3750 1.0629 1.0589 1.0631 1.0847 1.1040 1.1052 1.1068 1.0847 1.0880 1.0921 1.0957 1.1012 1.0802 1.0793
irintensity: 0.0347 0.0527 0.1345 0.3717 0.8577 0.7792 2.3164 0.3621 1.0334 3.5398 4.4361 1.4240 0.2790 12.7330 0.4606 91.1962 14.4631 33.5530 11.9621 9.6017 1.8481 10.9762 135.2707 21.6176 3.8893 58.4894 52.8813 6.1147 49.7834 2.6566 4.1529 0.5760 2.1191 3.2953 3.2686 5.4926 1.7533 12.8336 0.2027 11.4447 0.7944 0.3436 8.1734 3.4281 4.2774 12.5612 1.8876 5.0046 2.0968 1.4881 0.7617 16.8226 27.1348 15.9828 25.6148 6.8798 19.5622 2.8573 147.8666 75.9125 15.4569 20.5301 12.2440 1.2261 17.7202 8.6556 4.1544 1.6645 21.6098 0.1280 6.3634 474.0465 448.3392 38.5227 26.2431 45.1005 5.7192 14.1444 17.4597 58.4455 0.6377 4.8286 20.5221 23.2740 16.9609 74.2396 31.2118
temp: 298.150 k
press: 1.00000 atm
elementType: 8 8 7 7 6 6 6 6 6 6 6 6 6 6 6 6 6 1 1 1 1 1 1 1 1 1 1 1 1 1 1
symmnumber: 1
zpe: 650646.7 jmol-1
zpe.correction: 0.247818 hartree
zpe.thermalcorrener: 0.262485 hartree
zpe.thermalcorrenthalpy: 0.263429 hartree
zpe.thermalcorrgfe: 0.205140 hartree
zpe.sumelectzpe: -762.519935 hartree
zpe.sumelectthermal: -762.505268 hartree
zpe.sumelectthermalent: -762.504324 hartree
zpe.sumelectthermalfe: -762.562612 hartree
dipole: 1.4802 2.6955 -1.1121
dipole: 3.2701
quadrupole: -96.5239 -103.1569 -102.9201
quadrupole: -5.9080 -5.2294 -3.2077
quadrupole: 4.3431 -2.2900 -2.0531 -5.9080 -5.2294 -3.2077
hfenergy: -762.7677529 hartree
pointgroup: C01 [X(C13H14N2O2)]
dipole: -0.5530271 -1.029771 -0.5375242 debye
polarizability: 178.5863753|12.8773813|134.7987417|-0.2601385|-15.7726069|136.5143724 unknown
InChI: InChI=1S/C13H14N2O2/c16-11-13(10-7-4-8-10,15-12(17)14-11)9-5-2-1-3-6-9/h1-3,5-6,10,14-15H,4,7-8H2
charge 0 multiplicity 1
31 atoms
O  0.545083 0.384598 2.616233
O  2.478275 2.811152 -0.933833
N  1.088445 0.875908 -0.878054
N  1.602882 1.843757 1.073846
C  0.978004 -1.42486 0.140613
C  0.415179 0.026654 0.121697
C  2.527609 -1.661699 0.159219
C  0.885806 -2.293432 -1.162266
C  2.304055 -2.871364 -0.815834
C  -1.121361 0.019642 -0.025424
C  0.831433 0.744352 1.450896
C  1.798342 1.940738 -0.341691
C  -1.763679 0.683049 -1.098699
C  -1.913304 -0.667028 0.932105
C  -3.170896 0.641826 -1.229227
C  -3.318043 -0.700793 0.804391
C  -3.953465 -0.053652 -0.28131
H  0.505167 -1.950739 0.988557
H  2.990185 -1.868354 1.13749
H  3.07607 -0.839101 -0.333879
H  0.913053 -1.679505 -2.082315
H  0.042364 -2.99761 -1.237774
H  3.016565 -2.982742 -1.64861
H  2.234716 -3.830748 -0.274779
H  1.121541 0.671843 -1.874582
H  2.017091 2.512495 1.723681
H  -1.171475 1.250661 -1.82379
H  -1.435064 -1.142643 1.794535
H  -3.653114 1.158877 -2.06639
H  -3.917187 -1.226854 1.555864
H  -5.044178 -0.082928 -0.380367
