program: Gaussian 09
title: 000269818
version: EM64L-G09RevD.01
frameworkgroup: C1[X(C20H34N2O2)]
method: RPBEPBE
basis: SDD
operation: Freq
keyword: #p
keyword: freq=noraman
keyword: PBEPBE/SDD
title: #p freq=noraman PBEPBE/SDD
converged: YES YES NO NO
title: Mulliken charges:
elementType: O O N N C C C C C C C C C C C C C C C C C C C C H H H H H H H H H H H H H H H H H H H H H H H H H H H H H H H H H H
charge: -0.260938 -0.285595 -0.403213 -0.395120 -0.461247 -0.443998 -0.356679 -0.352529 -0.314887 -0.345432 -0.347477 -0.348461 0.221972 0.167595 0.228558 0.279371 -0.355661 -0.355526 -0.113996 -0.191178 -0.859263 -0.827866 -0.695056 -0.694496 0.203494 0.207667 0.217097 0.207509 0.196100 0.196487 0.191823 0.189513 0.244632 0.241685 0.229291 0.218435 0.187354 0.186688 0.189128 0.190506 0.339357 0.352507 0.196441 0.196400 0.194974 0.195619 0.218184 0.221332 0.295682 0.222035 0.218087 0.287556 0.217588 0.209802 0.209803 0.217031 0.210557 0.210755
chargesum: 0.00000
title: Mulliken charges with hydrogens summed into heavy atoms:
elementType: O O N N C C C C C C C C C C C C C C C C C C C C
charge: -0.260938 -0.285595 -0.063856 -0.042612 -0.050085 -0.019391 0.035909 0.028806 0.171430 0.102294 0.026564 0.031173 0.221972 0.167595 0.228558 0.279371 0.037179 0.035067 -0.113996 -0.191178 -0.127311 -0.096943 -0.057862 -0.056152
polarizability: 4.08753078e+02 -2.44484067e+01 2.35604383e+02 3.86872202e+00 1.09873510e+00 1.56762606e+02
1716.lowfreq: -9.1584 -1.6693 -0.0023 0.0006 0.0019 0.7731 9.5958 20.4297 22.6762
frequency: 7.6592 20.3802 21.9401 31.0492 43.4670 45.4733 53.2483 60.3645 87.9587 91.0975 104.3364 106.3090 109.9970 121.9589 134.2055 137.1078 140.8564 145.2947 153.2922 166.0856 176.6356 184.8401 204.0995 214.3046 230.3617 235.7078 239.6916 256.1338 307.8846 309.3869 335.7680 364.1675 374.1548 395.1208 412.0069 422.8316 446.1217 448.3352 464.5869 479.0040 490.6566 553.0354 609.3729 614.4847 648.4821 722.7465 725.3018 737.7156 742.8320 743.8666 745.0596 780.1880 788.2523 796.1462 811.7529 871.0659 881.3181 884.7931 890.3706 892.1760 921.5669 985.9318 986.9788 993.2761 1006.3374 1017.3333 1025.3457 1037.8068 1039.7949 1041.6020 1046.2078 1066.1822 1067.7774 1072.3633 1080.2804 1085.5150 1093.5546 1118.9381 1130.7566 1139.6334 1146.4911 1148.8330 1197.6887 1197.9889 1234.4461 1237.8449 1244.6412 1247.2455 1273.6707 1279.7295 1281.4737 1285.3911 1286.7398 1288.5610 1293.5661 1294.5001 1301.8453 1314.4056 1325.3748 1341.5827 1350.3896 1352.0663 1357.2331 1357.6092 1367.2630 1382.8276 1389.2888 1390.7342 1391.1052 1413.4562 1440.3159 1461.1625 1462.3130 1462.8024 1464.7859 1466.2950 1467.0760 1472.2287 1473.7992 1477.1450 1477.8739 1478.4948 1480.8157 1483.8641 1487.7804 1489.0897 1489.9502 1490.9690 1494.5990 1503.6471 1504.9422 1568.0741 1594.8393 1622.6837 2943.8522 2950.8445 2953.9103 2954.0013 2956.3924 2958.4007 2964.1145 2967.7621 2970.8592 2972.5245 2972.6650 2973.2384 2979.5861 2989.9483 2991.4525 2998.7022 3005.6539 3006.5560 3009.5166 3018.5125 3023.1341 3037.2537 3038.0932 3054.1243 3062.0998 3066.0412 3069.1702 3069.8564 3072.3098 3072.5113 3094.7027 3097.2282 3306.6245 3506.5032
redmass: 4.3934 4.1384 3.9247 1.7495 3.1088 3.8363 1.8091 3.1018 3.8006 2.4321 1.8174 2.6527 2.8764 2.6133 2.3235 2.8936 2.4917 3.9760 1.8628 1.1614 1.6966 1.9278 4.3871 2.9696 1.1309 1.1296 3.2254 3.3628 3.3258 3.6772 3.1076 4.2610 3.9026 3.9010 5.6231 5.2815 4.2941 2.6411 5.6963 3.6256 3.6537 3.6049 5.3820 2.0802 6.0649 1.0649 1.0654 1.2701 1.4241 3.7033 2.4298 1.1698 1.1706 1.1821 4.9998 2.3219 1.2062 1.3218 1.8925 1.7309 5.0929 1.1623 1.1613 4.0826 3.6657 2.2157 3.4761 1.4713 1.5800 2.4391 2.7488 2.9847 2.8133 2.4929 2.1687 2.3167 2.7981 2.8977 3.0197 3.3009 1.5276 1.6983 1.5245 1.5070 1.3245 1.3243 1.2506 1.2854 1.1245 1.2349 1.5035 1.3045 1.1088 1.0695 1.1728 1.1109 1.7366 2.3134 1.3892 1.7189 1.8876 2.1659 1.6892 1.6857 1.7064 1.5097 1.2757 1.2167 1.2166 5.3765 1.2989 1.0913 1.0835 1.0706 1.0697 1.0777 1.0999 1.1646 1.1018 1.0807 1.1534 1.0441 1.1302 1.1705 1.1602 1.1061 1.0466 1.3729 1.2764 1.7524 1.7826 2.9814 4.2207 9.0381 1.0401 1.0582 1.0604 1.0587 1.0636 1.0592 1.0591 1.0595 1.0582 1.0584 1.0370 1.0369 1.0435 1.0975 1.0974 1.1006 1.1002 1.0599 1.0979 1.1033 1.1003 1.1011 1.1046 1.0986 1.1042 1.0952 1.1007 1.1006 1.0993 1.0994 1.0934 1.0982 1.0747 1.0750
irintensity: 0.3841 0.0046 0.0541 0.0597 1.1090 1.1228 0.1922 0.0993 5.5649 0.8759 1.7941 0.0966 0.4084 0.0223 0.1310 0.0382 0.1670 0.0792 1.1263 0.2836 0.4764 0.0891 2.1509 0.0833 0.0163 0.0716 2.4954 0.0042 0.7239 0.5648 0.3734 2.5345 1.1493 0.0620 44.2704 0.9325 4.7194 12.1400 0.4793 11.9328 0.6828 0.1555 1.3595 69.3360 6.5330 12.3672 12.2845 0.4612 1.2275 0.2556 2.1645 69.7249 0.2122 1.2456 7.1857 2.4627 1.6717 1.6084 5.1057 2.7269 13.7049 0.1974 0.5411 7.6370 0.3694 0.3794 3.9848 1.3187 1.1847 6.3415 13.3363 3.0173 29.5229 10.0754 11.3963 16.6456 6.5403 33.7359 5.8613 39.7993 0.7569 0.3303 0.9441 0.1565 7.0070 1.2842 0.0764 1.6662 0.0296 2.6915 5.7410 4.1147 1.2334 0.3980 2.2986 0.3340 21.9102 69.6072 1.1652 7.6424 18.1450 55.2528 6.5672 9.3456 31.1256 31.3302 38.0611 10.4916 10.6970 295.2960 13.5231 0.9838 15.2196 2.9271 0.7614 3.0714 2.0614 109.8224 0.1912 34.9749 84.0616 13.0160 1.8465 139.8323 37.5110 11.3826 17.6711 131.8211 3.9680 10.8247 532.4854 73.9533 229.9470 175.7736 43.0408 10.0569 3.7760 9.0070 10.9654 6.7209 2.1578 17.5790 117.4798 88.3160 36.9551 53.4865 63.6226 1.8279 0.8914 2.1290 1.2703 15.5793 28.5345 0.0604 4.0384 49.2083 66.8425 41.1095 37.7408 44.9115 99.4801 106.7911 52.1435 56.7735 1.5895 4.7639 84.3160 51.7911
temp: 298.150 k
press: 1.00000 atm
elementType: 8 8 7 7 6 6 6 6 6 6 6 6 6 6 6 6 6 6 6 6 6 6 6 6 1 1 1 1 1 1 1 1 1 1 1 1 1 1 1 1 1 1 1 1 1 1 1 1 1 1 1 1 1 1 1 1 1 1
symmnumber: 1
zpe: 1328259.9 jmol-1
zpe.correction: 0.505907 hartree
zpe.thermalcorrener: 0.535179 hartree
zpe.thermalcorrenthalpy: 0.536123 hartree
zpe.thermalcorrgfe: 0.441401 hartree
zpe.sumelectzpe: -1040.593995 hartree
zpe.sumelectthermal: -1040.564724 hartree
zpe.sumelectthermalent: -1040.563780 hartree
zpe.sumelectthermalfe: -1040.658502 hartree
dipole: 0.4127 -0.2611 0.0889
dipole: 0.4964
quadrupole: -114.8353 -159.7698 -148.3853
quadrupole: 13.1215 1.0634 0.0134
quadrupole: 26.1615 -18.7730 -7.3885 13.1215 1.0634 0.0134
hfenergy: -1041.0999029 hartree
pointgroup: C01[X(C20H34N2O2)]
dipole: -0.1622372 0.1053964 0.0266642 debye
polarizability: 408.6752792|-24.9556852|235.0528875|-1.5001103|-7.1829308|157.3918999 unknown
InChI: InChI=1S/C20H34N2O2/c1-5-7-9-11-13-21-17-15(3)20(24)18(16(4)19(17)23)22-14-12-10-8-6-2/h21-22H,5-14H2,1-4H3
charge 0 multiplicity 1
58 atoms
O  -1.523329 1.914496 -0.430307
O  1.529382 -2.625603 -0.095871
N  -2.805067 -0.564769 -0.12395
N  2.788589 -0.381656 -0.345717
C  -5.233195 -0.129026 -0.094868
C  5.23022 -0.065213 -0.163147
C  -6.351515 0.92811 -0.229897
C  6.41226 0.919534 -0.300452
C  -3.830758 0.499627 -0.217298
C  3.876805 0.595266 -0.496608
C  -7.770422 0.331539 -0.095509
C  7.781132 0.262379 -0.013377
C  -1.434761 -0.49216 -0.184722
C  1.431203 -0.21975 -0.318766
C  -0.675485 -1.670872 -0.093744
C  0.678056 0.958014 -0.409665
C  -8.889272 1.387605 -0.245797
C  8.965589 1.249012 -0.129033
C  -0.772094 0.86976 -0.348852
C  0.756714 -1.591036 -0.160871
C  -1.321007 -3.031519 0.069474
C  1.251736 2.35848 -0.565341
C  -10.305209 0.788009 -0.107051
C  10.331559 0.582704 0.142907
H  -5.36654 -0.902461 -0.880712
H  -5.33013 -0.64155 0.88516
H  5.195849 -0.46651 0.869538
H  5.392092 -0.930676 -0.838465
H  -6.258659 1.435606 -1.212118
H  -6.209759 1.713447 0.540836
H  6.263948 1.773118 0.393209
H  6.420716 1.34677 -1.325035
H  -3.664146 1.253179 0.572862
H  -3.723781 1.040329 -1.175078
H  3.70773 1.45814 0.171654
H  3.90735 0.984651 -1.535365
H  -7.869654 -0.166849 0.891567
H  -7.911971 -0.460854 -0.860187
H  7.938434 -0.581441 -0.71708
H  7.771812 -0.179275 1.00494
H  -3.182835 -1.50968 -0.009993
H  3.041113 -1.385341 -0.273359
H  -8.745941 2.180852 0.516077
H  -8.791052 1.883795 -1.232856
H  8.967894 1.698551 -1.143171
H  8.812811 2.086507 0.581978
H  -1.986919 -3.287108 -0.780801
H  1.709019 2.730333 0.371516
H  -0.53105 -3.797615 0.116154
H  2.008724 2.420916 -1.365209
H  -1.91699 -3.105722 1.002778
H  0.425692 3.04373 -0.815318
H  -11.085734 1.563184 -0.216205
H  -10.438629 0.311246 0.882513
H  -10.486405 0.015363 -0.878043
H  11.160818 1.308409 0.055033
H  10.522354 -0.237118 -0.57507
H  10.366906 0.151033 1.161015
