program: Gaussian 09
title: 000269810
version: EM64L-G09RevD.01
frameworkgroup: C1[X(C13H14ClNO3)]
method: RPBEPBE
basis: SDD
operation: Freq
keyword: #p
keyword: freq=noraman
keyword: PBEPBE/SDD
title: #p freq=noraman PBEPBE/SDD
converged: NO YES NO NO
title: Mulliken charges:
elementType: Cl O O O N C C C C C C C C C C C C C H H H H H H H H H H H H H H
charge: -0.051699 -0.212656 -0.242104 -0.253051 -0.615123 -0.369632 0.287409 -0.432362 0.544380 0.200385 -0.713225 -0.726239 0.204837 -0.447561 -0.378228 -0.205201 -0.227510 -0.119316 0.288700 0.320785 0.222601 0.239971 0.250926 0.222117 0.258033 0.233271 0.245487 0.255377 0.257528 0.258216 0.365382 0.338502
chargesum: 0.00000
title: Mulliken charges with hydrogens summed into heavy atoms:
elementType: Cl O O O N C C C C C C C C C C C C C
charge: -0.051699 -0.212656 -0.242104 -0.253051 0.088762 -0.080932 0.287409 -0.111576 0.544380 0.200385 0.000272 -0.012818 0.204837 -0.202074 -0.122851 0.052327 0.030707 -0.119316
polarizability: 2.11650592e+02 -2.83641539e+00 1.20007974e+02 2.85902361e+00 -6.14181687e+00 1.50209078e+02
1716.lowfreq: -13.3427 -0.0029 -0.0020 -0.0010 1.6481 6.1318 33.8602 43.0933 54.8732
frequency: 33.7940 43.0472 54.8698 67.0615 96.0460 107.1825 144.9374 170.6879 195.3157 199.7474 233.8182 240.2357 261.5239 305.4706 330.0330 333.7655 352.5743 397.9340 403.7983 409.6552 464.0762 474.1098 528.8313 549.2071 561.6983 573.5252 611.6583 624.5994 643.6198 679.6863 688.2750 698.1605 722.3042 781.0225 814.1243 832.1580 843.7798 866.4863 901.3569 911.6311 933.0345 950.1829 957.3961 967.8614 1000.0156 1003.4384 1064.0949 1075.1148 1093.2625 1103.5352 1116.4179 1144.3161 1189.9616 1196.8051 1205.9916 1218.2368 1240.1123 1254.3478 1277.8815 1296.4654 1321.0989 1331.3056 1383.1699 1384.8103 1399.0940 1413.3541 1453.6878 1459.8465 1472.6296 1479.4755 1481.8653 1584.7917 1594.8077 1600.8740 1652.4489 1661.1668 2992.7521 3001.3177 3022.6889 3030.4375 3089.7855 3095.2762 3102.5924 3114.3902 3128.9091 3134.8632 3168.5045 3171.5268 3452.7545 3635.6292
redmass: 5.1985 7.0030 5.2438 6.0591 5.3619 4.8762 7.4078 4.1756 1.1472 5.0775 1.1478 6.6617 3.1643 3.9034 2.9681 5.3995 3.5975 4.2437 5.7798 2.9724 4.8173 3.3533 2.5954 3.0438 3.8058 4.3884 4.6435 4.8767 2.0555 5.4315 1.1494 4.1237 3.8903 3.6693 3.8819 1.2618 2.0422 4.9587 3.9119 3.8450 1.5718 1.5542 1.6676 1.3750 3.5596 1.4026 2.6291 2.6917 2.0876 2.0070 1.4811 2.7724 1.1702 2.0653 2.7394 1.3796 1.8495 2.2344 1.7178 1.3785 3.3308 2.4223 4.6520 1.2254 1.2513 1.8422 1.0519 1.0490 1.0764 2.1263 1.1039 6.1666 1.5661 6.1097 4.4723 6.3233 1.0357 1.0367 1.0832 1.0841 1.0990 1.0997 1.1004 1.0994 1.0898 1.0898 1.0951 1.0962 1.0505 1.1002
irintensity: 0.1022 0.8599 0.2371 8.7468 1.0477 1.8594 4.1835 7.6812 1.5523 3.2582 1.6291 5.7428 0.6096 1.7328 5.2368 2.4598 0.7860 1.3965 16.1748 1.0015 6.3027 6.6102 49.4042 10.5043 7.3837 6.8334 12.4196 14.5164 98.7782 45.7883 133.3183 12.7149 2.0515 13.4276 34.9244 0.3383 39.2800 15.8875 21.3050 30.6984 5.3828 1.6793 2.0099 0.3878 38.1493 1.1809 27.5227 54.5590 38.0196 86.2288 40.8030 118.8904 0.0111 26.4542 16.9375 20.2978 16.3738 42.3137 14.7085 0.0770 135.9809 13.4020 1.4745 23.1668 27.1064 3.4074 4.8006 3.3360 6.2497 68.6116 36.3583 7.1653 203.4148 11.4487 254.5122 292.1691 10.8932 12.7139 1.6621 6.6924 10.1741 18.5139 21.6033 20.4975 8.8698 7.5752 4.4599 0.3930 55.6728 69.2624
temp: 298.150 k
press: 1.00000 atm
elementType: 17 8 8 8 7 6 6 6 6 6 6 6 6 6 6 6 6 6 1 1 1 1 1 1 1 1 1 1 1 1 1 1
symmnumber: 1
zpe: 647515.5 jmol-1
zpe.correction: 0.246626 hartree
zpe.thermalcorrener: 0.263802 hartree
zpe.thermalcorrenthalpy: 0.264746 hartree
zpe.thermalcorrgfe: 0.200899 hartree
zpe.sumelectzpe: -1242.981890 hartree
zpe.sumelectthermal: -1242.964713 hartree
zpe.sumelectthermalent: -1242.963769 hartree
zpe.sumelectthermalfe: -1243.027617 hartree
dipole: 0.5386 0.4065 -1.2039
dipole: 1.3802
quadrupole: -119.5865 -108.0167 -119.5204
quadrupole: -5.9227 -1.3365 -8.3046
quadrupole: -3.8787 7.6912 -3.8125 -5.9227 -1.3365 -8.3046
hfenergy: -1243.2285155 hartree
pointgroup: C01 [X(C13H14Cl1N1O3)]
dipole: -0.1671106 0.2199306 0.4674908 debye
polarizability: 207.4034205|17.1076149|126.2546302|-9.9830992|8.9826742|148.2095938 unknown
InChI: InChI=1S/C13H14ClNO3/c1-13(2)10(7-3-5-8(14)6-4-7)9(11(15)16)12(17)18-13/h3-6,9-10H,15H2,1-2H3
charge 0 multiplicity 1
32 atoms
Cl 5.742894 0.25056 -1.35516
O  -1.79902 0.900006 -1.254028
O  -2.558916 -1.185075 -1.932759
O  -1.574848 -1.453107 2.322912
N  -2.705918 -2.588996 0.62981
C  -0.160382 0.249828 0.455121
C  -1.026918 1.472892 -0.057081
C  -0.96158 -0.983431 -0.029809
C  1.29005 0.241693 -0.013156
C  -1.859739 -0.48221 -1.169827
C  -2.083548 1.883484 0.984432
C  -0.257975 2.680613 -0.593849
C  -1.784121 -1.68381 1.097246
C  2.329152 0.500264 0.915286
C  1.644888 -0.015618 -1.364697
C  3.68624 0.505932 0.520486
C  2.993929 -0.015101 -1.780434
C  3.996969 0.248732 -0.827448
H  -0.177221 0.257247 1.559757
H  -0.296004 -1.76425 -0.44255
H  -1.599139 2.436713 1.809091
H  -2.838455 2.539784 0.518818
H  -2.594248 1.009142 1.422875
H  0.380789 3.105063 0.201018
H  0.389243 2.407544 -1.4419
H  -0.965759 3.45856 -0.927098
H  2.080646 0.688164 1.966323
H  0.868662 -0.214625 -2.113277
H  4.481258 0.700045 1.246146
H  3.25882 -0.213456 -2.822909
H  -2.894965 -2.666075 -0.375049
H  -3.263685 -3.11561 1.301413
