program: Gaussian 09
title: 000269786
version: EM64L-G09RevD.01
frameworkgroup: C1[X(C7H8N2O2)]
method: RPBEPBE
basis: SDD
operation: Freq
keyword: #pfreq=noraman
keyword: PBEPBE/SDD
title: #p freq=noraman PBEPBE/SDD
converged: NO YES NO NO
title: Mulliken charges:
elementType: O O N N C C C C C C C H H H H H H H H
charge: -0.210681 -0.233399 -0.441726 0.008404 0.038743 -0.536394 -0.307862 0.306961 0.097331 -0.779298 -0.001525 0.245219 0.245322 0.236108 0.236118 0.335107 0.253589 0.253766 0.254219
chargesum: 0.00000
title: Mulliken charges with hydrogens summed into heavy atoms:
elementType: O O N N C C C C C C C
charge: -0.210681 -0.233399 -0.106619 0.008404 0.038743 -0.045853 0.164364 0.306961 0.097331 -0.017724 -0.001525
polarizability: 1.32400458e+02 1.67478690e+00 1.00223662e+02 9.69005104e-03 7.19141885e-03 5.13732470e+01
1716.lowfreq: -41.5749 -6.4967 -5.5745 -0.0012 -0.0011 -0.0007 2.0759 65.5026 103.2372
frequency: -41.5158 65.4860 103.2295 165.1918 220.5349 251.8803 258.6161 342.9369 460.5262 516.2262 542.2319 562.3399 602.6792 655.8159 706.0230 708.8707 750.4182 769.0112 823.8770 876.0326 919.8486 978.3268 980.6629 1033.3652 1039.7312 1055.2229 1091.4848 1167.7071 1180.7265 1205.0929 1257.0193 1281.3084 1322.5781 1373.6342 1401.4617 1408.4086 1465.7795 1467.8250 1471.8731 1487.7567 1558.2972 1650.2542 1671.5362 2985.4558 2996.4647 3041.9242 3045.3336 3063.2217 3110.3804 3114.7535 3526.5017
redmass: 1.8692 1.0306 5.4601 4.1404 6.5163 2.7680 4.2767 7.2293 7.3505 8.1273 4.2241 5.9377 4.7513 1.8174 8.6762 2.5960 4.5293 6.5015 1.2456 5.6862 4.5117 4.2927 2.8821 1.4979 2.3191 1.6293 8.9874 1.1222 3.5108 1.1096 1.5890 3.1859 1.7198 2.0959 1.2468 2.8723 1.0835 1.0429 1.0950 1.1001 9.1972 6.4043 8.7921 1.0386 1.0591 1.0585 1.1050 1.0979 1.1112 1.0975 1.0779
irintensity: 2.7213 0.2906 0.0870 0.9409 0.4936 0.5804 4.4665 0.2475 1.1046 11.4526 2.7935 0.2487 4.3661 48.0241 1.5230 4.7511 62.0119 0.5074 1.0635 51.6622 6.9404 20.5377 23.5791 4.5394 28.8888 1.9085 65.8921 0.5454 83.8460 0.3555 10.6148 164.9694 48.4685 82.1617 30.6767 6.4301 26.0746 13.4329 17.8224 1.0644 213.5278 562.5968 278.8505 14.9658 27.2871 61.9562 8.9265 9.7977 24.9347 11.9048 47.1742
temp: 298.150 k
press: 1.00000 atm
elementType: 8 8 7 7 6 6 6 6 6 6 6 1 1 1 1 1 1 1 1
symmnumber: 1
zpe: 381225.1 jmol-1
zpe.correction: 0.145201 hartree
zpe.thermalcorrener: 0.154097 hartree
zpe.thermalcorrenthalpy: 0.155042 hartree
zpe.thermalcorrgfe: 0.110673 hartree
zpe.sumelectzpe: -530.690773 hartree
zpe.sumelectthermal: -530.681876 hartree
zpe.sumelectthermalent: -530.680932 hartree
zpe.sumelectthermalfe: -530.725301 hartree
dipole: 4.9727 8.3029 -0.0018
dipole: 9.6781
quadrupole: -64.6539 -68.7264 -62.8730
quadrupole: -10.1748 0.0089 0.0012
quadrupole: 0.7639 -3.3087 2.5448 -10.1748 0.0089 0.0012
hfenergy: -530.8359738 hartree
pointgroup: C01 [X(C7H8N2O2)]
dipole: -2.1686968 3.1283685 0.0907473 debye
dipolederiv: -1.3796743 -0.1990992 -0.01671 -0.4635971 -0.5216391 -0.0123435 -0.0263046 -0.0098498 -0.2968937 -1.4301487 0.4090464 0.0048169 0.24087 -0.5405909 -0.0030724 -0.0011729 -0.0015788 -0.3904154 -0.9033035 -0.1056896 -0.0100084 0.6083509 -0.7331696 -0.0104378 0.0160125 -0.0177774 -0.2726808 -1.5770856 0.2259656 -0.0041445 -0.0573686 -0.4233158 -0.0062197 -0.0138813 -0.0036288 -0.2663792 -0.228489 -0.0923286 -0.0041819 -0.3673717 -0.9135448 -0.032063 -0.0139316 -0.0292651 -0.1078662 -0.0366458 -0.1048671 -0.0054537 0.0626566 -0.0286129 -0.0068001 0.0003988 -0.0082608 0.188222 0.7587014 0.0541731 0.0054958 -0.2452736 0.2376879 -0.005262 -0.0049915 -0.0028328 0.3324301 0.8988609 0.4111332 0.0230277 -0.0464487 0.5801797 0.0169143 0.0061227 0.020053 0.0748566 1.7078866 -0.0923298 0.0102418 0.427926 1.0976242 0.0350665 0.0285531 0.0303383 0.2099467 -0.004674 -0.052272 -0.0019761 0.048798 -0.1936766 -0.0080559 0.001858 -0.0059334 0.0558359 2.0910004 -0.4809889 0.0000541 -0.3601592 1.0092961 0.024223 0.0037548 0.0238398 0.2400959 -0.0065338 0.0366547 0.0436083 0.0600857 0.020688 -0.074776 0.0947699 -0.0934069 -0.0373045 -0.0044031 0.0377439 -0.0408384 0.0645087 0.0095666 0.0790016 -0.090225 0.0972366 -0.0285517 -0.0593975 -0.034313 0.0683815 0.0204402 0.0551107 0.032736 0.1435451 0.0539689 -0.0417538 -0.0559428 -0.0287875 -0.0708786 0.0303458 0.0606924 -0.025122 -0.1417887 -0.0473085 -0.0503684 0.196208 -0.0013661 -0.0012219 0.0116282 0.1506825 -0.0057445 -0.0007866 -0.0060332 0.3121872 0.0583519 -0.0373353 -0.092089 -0.021274 0.032487 -0.0323342 -0.0861443 -0.0861023 -0.0214015 -0.0832334 0.0982742 0.003507 0.0138149 0.0776514 -0.0011411 0.0001257 -0.0014826 0.1123111 0.0585225 -0.0436138 0.0883695 -0.0279321 0.0228832 0.0354307 0.0840857 0.0880236 -0.0122704 unknown
polarizability: 132.4729659|0.4417793|100.0826274|0.8015341|1.7225004|51.4417736 unknown
InChI: InChI=1S/C7H8N2O2/c1-4-5-2-3-11-6(5)9-7(10)8-4/h8H,2-3H2,1H3
charge 0 multiplicity 1
19 atoms
O  -1.592967 -1.662936 -0.112136
O  3.079879 -0.996065 -0.044918
N  1.600902 0.803962 0.006305
N  0.758385 -1.469235 -0.083537
C  -0.739856 0.518713 -0.028287
C  -2.238532 0.730932 -0.035773
C  -2.778315 -0.738856 -0.089799
C  0.338153 1.384194 0.013981
C  -0.43305 -0.891897 -0.074759
C  0.254023 2.889353 0.066658
C  1.878325 -0.622644 -0.042603
H  -2.597896 1.251807 0.870188
H  -2.580862 1.31083 -0.911995
H  -3.370149 -1.012449 0.798211
H  -3.356275 -0.951246 -1.003303
H  2.439826 1.39012 0.036157
H  0.749278 3.283847 0.97352
H  -0.795094 3.221817 0.077731
H  0.749826 3.346154 -0.81024
