program: Gaussian 09
title: 000269779
version: EM64L-G09RevD.01
frameworkgroup: C1[X(C8H11NS)]
method: RPBEPBE
basis: SDD
operation: Freq
keyword: #p
keyword: freq=noraman
keyword: PBEPBE/SDD
title: #p freq=noraman PBEPBE/SDD
converged: YES YES NO NO
title: Mulliken charges:
elementType: S N C C C C C C C C H H H H H H H H H H H
charge: -0.016172 0.002209 -0.533146 -0.316176 0.481685 -0.718639 -0.334334 -0.500371 -0.186423 -0.332134 0.207949 0.208706 0.239895 0.214661 0.258734 0.269858 0.241740 0.247689 0.229775 0.241983 0.092511
chargesum: 0.00000
title: Mulliken charges with hydrogens summed into heavy atoms:
elementType: S N C C C C C C C C
charge: 0.076339 0.002209 -0.116492 0.138380 0.481685 -0.190046 -0.092594 -0.252682 0.043352 -0.090151
polarizability: 1.40243346e+02 4.45891826e+00 1.01434467e+02 -7.58670499e+00 4.41401808e-01 7.26032515e+01
1716.lowfreq: -14.8752 -6.7218 -0.0008 -0.0008 -0.0007 5.5892 21.7765 62.0800 67.8722
frequency: 20.6634 61.9106 67.7950 102.8511 187.5693 215.8285 246.1876 316.1619 339.8398 398.0950 503.9181 578.6632 620.2864 682.8308 724.1744 731.3938 775.3127 802.2763 828.6463 872.7836 923.2083 938.8880 986.3065 1003.6569 1012.9718 1029.3663 1042.1273 1058.8309 1109.6780 1136.4550 1193.3213 1230.0683 1236.4728 1253.7995 1283.1380 1298.1057 1311.7263 1333.6677 1341.7876 1415.4427 1449.2521 1458.4357 1466.8187 1480.8407 1557.5762 1586.9605 2428.9325 2976.1458 2989.5368 3020.5435 3028.2665 3055.7337 3095.2978 3111.1124 3121.7408 3133.5013 3162.9506
redmass: 3.8395 3.1741 2.5669 2.7006 3.4019 1.1824 5.6426 2.6814 3.1450 3.2282 3.9671 5.5316 7.1446 3.4821 1.8263 1.1929 1.2412 2.2432 2.7048 1.2516 1.3653 1.4846 1.4131 3.5058 3.8562 3.1568 1.7335 3.0684 1.4454 1.1595 1.4663 1.6281 1.3446 1.3091 1.0984 1.3441 6.3264 1.4003 1.2307 2.0622 1.0832 2.1439 1.0990 1.0997 5.4679 5.9514 1.0383 1.0596 1.0620 1.0596 1.0979 1.1028 1.1071 1.0910 1.0891 1.0909 1.0998
irintensity: 1.2008 1.8359 0.6277 1.0220 1.1751 29.6728 0.2014 0.1930 2.4154 3.5237 5.2808 0.3514 3.5281 8.3267 38.5321 3.5785 6.1878 21.0731 9.5545 4.1044 1.4969 0.4457 0.0838 7.1128 3.3338 0.9876 2.8661 2.0442 11.1594 2.0915 2.4116 0.8788 5.7459 6.7204 0.8611 17.7282 0.5380 0.8863 1.3246 19.7799 3.2649 25.0826 1.8684 15.7548 4.8111 2.1814 30.3643 19.4073 23.6317 32.2410 8.3909 16.3875 24.9591 26.5660 8.5311 17.8470 27.1803
temp: 298.150 k
press: 1.00000 atm
elementType: 16 7 6 6 6 6 6 6 6 6 1 1 1 1 1 1 1 1 1 1 1
symmnumber: 1
zpe: 444651.1 jmol-1
zpe.correction: 0.169359 hartree
zpe.thermalcorrener: 0.179775 hartree
zpe.thermalcorrenthalpy: 0.180719 hartree
zpe.thermalcorrgfe: 0.131107 hartree
zpe.sumelectzpe: -763.494903 hartree
zpe.sumelectthermal: -763.484486 hartree
zpe.sumelectthermalent: -763.483542 hartree
zpe.sumelectthermalfe: -763.533154 hartree
dipole: -0.1830 2.6359 1.9326
dipole: 3.2736
quadrupole: -82.8017 -63.6058 -70.1679
quadrupole: 6.1718 -2.0959 -2.4357
quadrupole: -10.6099 8.5860 2.0239 6.1718 -2.0959 -2.4357
hfenergy: -763.6642614 hartree
pointgroup: C01 [X(C8H11N1S1)]
dipole: 0.082993 1.2126951 -0.4257271 debye
dipolederiv: -0.3785466 -0.143569 0.0112757 -0.2073292 0.0668831 0.0187469 -0.084616 0.0731625 -0.2074156 -0.3449865 -0.015285 0.0254898 -0.026065 -0.3140327 -0.0058307 0.0491491 -0.0028495 -0.245203 -0.2639058 -0.0109422 -0.0536579 -0.0339324 0.1743624 0.0004783 -0.0773923 -0.0064213 0.1560773 -0.0372485 -0.0203146 0.0183828 0.0064392 0.1184417 0.0131502 0.0497626 -0.0087275 -0.0494839 0.3965074 -0.0457358 -0.0619369 0.0594088 -0.2084159 -0.0533624 -0.1703082 -0.0099296 -0.0241569 0.3195061 0.0113116 0.1135689 0.0941009 0.1038531 0.0624728 0.13309 -0.0312908 0.2575303 -0.0572497 0.0294738 -0.0657309 0.0973141 0.126474 -0.0057607 -0.0247907 0.0180493 -0.1076178 -0.0290317 0.030903 -0.0592128 -0.1666878 0.2904393 0.1070944 -0.0387469 0.0196405 -0.0589271 -0.1448971 -0.044339 0.0163481 -0.1842068 0.0235029 0.073221 0.0098451 0.0289153 -0.0981513 0.2615162 -0.0395165 -0.1566013 0.1277971 0.0782634 -0.0329428 -0.1306482 0.0332009 -0.0336395 0.0261156 -0.0169535 0.0478284 -0.0354841 -0.0517586 0.1380696 0.0463695 0.0758489 -0.0281814 0.0419689 0.0157637 0.0236453 0.0501398 -0.077864 -0.12934 0.0235065 -0.0658857 0.0089813 0.0575217 -0.0291594 0.0117058 -0.0288384 -0.0246158 0.0948841 0.0366717 0.0801951 -0.0138039 0.0391634 0.0325335 0.0013645 0.027609 -0.0742264 -0.112866 0.0301214 -0.0771033 0.0045628 -0.0168879 0.0082747 -0.0626113 -0.033156 -0.0338091 0.1254222 -0.0148462 0.0916103 -0.0815978 0.0416966 0.0039436 -0.0255636 0.0526637 -0.0328302 -0.0994376 0.0102727 -0.0826021 0.0172268 0.0495051 -0.1061771 0.0342522 -0.095908 -0.0370292 0.0159242 0.0268138 0.0225141 0.1173519 0.0341404 0.0901072 0.0531541 0.0997663 -0.0374925 -0.050696 0.0501393 -0.0504644 0.0970239 0.0432643 0.0741855 0.0455089 0.0998185 -0.0591479 -0.0536444 0.0556725 -0.0476512 0.1350948 -0.1004882 0.0230591 0.0924116 -0.0000903 0.0854623 -0.0040742 0.0914626 -0.0154408 0.1030952 0.0623363 0.1524365 -0.0096215 0.0966407 -0.1164599 -0.1015089 -0.0715283 -0.0447707 0.0512339 unknown
polarizability: 141.0694941|-2.0484753|99.2488437|-4.7555883|7.3690331|73.9627271 unknown
InChI: InChI=1S/C8H11NS/c10-6-2-4-8-3-1-5-9-7-8/h1,3,5,7,10H,2,4,6H2
charge 0 multiplicity 1
21 atoms
S  4.700746 0.023776 0.98464
N  -2.543791 -1.231815 0.190912
C  0.90558 -0.04398 -1.009039
C  1.950334 0.038612 0.14396
C  -0.521073 -0.000844 -0.490607
C  3.391206 0.015217 -0.389882
C  -1.14857 1.218915 -0.128371
C  -1.274156 -1.190886 -0.310038
C  -2.46172 1.202127 0.389824
C  -3.118859 -0.041831 0.53553
H  1.078795 0.793707 -1.71384
H  1.071197 -0.980782 -1.575832
H  1.800404 -0.805474 0.842665
H  1.778379 0.965585 0.726094
H  3.590963 0.866499 -1.063339
H  3.597925 -0.917358 -0.943023
H  -0.616194 2.169384 -0.257458
H  -0.841249 -2.162241 -0.582828
H  -2.970754 2.128966 0.673358
H  -4.137619 -0.099796 0.935422
H  4.359757 1.264223 1.501651
