program: Gaussian 09
title: 000277182
version: EM64L-G09RevD.01
frameworkgroup: C1[X(C18H11Cl2N5)]
method: RPBEPBE
basis: SDD
operation: Freq
keyword: #p
keyword: freq=noraman
keyword: PBEPBE/SDD
title: #p freq=noraman PBEPBE/SDD
converged: YES YES NO NO
title: Mulliken charges:
elementType: Cl Cl N N N N N C C C C C C C C C C C C C C C C C C H H H H H H H H H H H
charge: -0.042809 -0.044132 -0.045855 0.034436 0.009466 -0.040143 -0.595732 0.002347 -0.003239 0.316940 0.319528 -0.090214 -0.096938 -0.358497 -0.375914 -0.355373 -0.354522 0.133218 -0.204827 -0.213446 -0.210240 -0.216281 -0.121337 -0.119241 -0.380298 0.266602 0.258261 0.264146 0.282584 0.261637 0.258387 0.260318 0.260367 0.250108 0.339971 0.350726
chargesum: 0.00000
title: Mulliken charges with hydrogens summed into heavy atoms:
elementType: Cl Cl N N N N N C C C C C C C C C C C C C C C C C C
charge: -0.042809 -0.044132 -0.045855 0.034436 0.009466 -0.040143 0.094965 0.002347 -0.003239 0.316940 0.319528 -0.090214 -0.096938 -0.091896 -0.117653 -0.091228 -0.071938 0.133218 0.056810 0.044941 0.050077 0.044085 -0.121337 -0.119241 -0.130190
polarizability: 4.20663675e+02 -8.29213920e+00 3.04834726e+02 -4.82378372e+00 -3.42309595e+01 1.31812932e+02
1716.lowfreq: -6.5636 -4.0743 -2.4242 -0.0019 -0.0015 0.0008 25.3693 32.0641 42.0978
frequency: 25.3487 32.0432 42.0749 47.9228 62.0594 73.4552 122.2234 126.7525 152.9719 180.8441 200.9332 208.6062 226.6881 252.0867 264.4643 288.9596 319.4530 355.2310 383.2595 406.0631 409.1367 412.3070 436.1434 447.7943 468.2512 489.2235 535.8963 541.9779 543.9029 568.6254 577.3017 598.8240 609.2441 614.6712 624.2136 632.4970 665.1806 697.8805 706.6083 712.3018 723.3874 759.8408 771.5064 826.0725 828.3160 830.2694 833.7445 842.9577 861.5090 926.9173 947.9793 954.5784 959.1829 968.7775 971.8980 973.5969 998.3411 1001.1859 1052.1598 1073.6286 1076.3123 1099.0907 1111.1198 1115.4332 1187.4535 1189.2508 1202.9300 1216.5524 1237.5058 1295.5420 1295.8218 1309.5875 1327.8850 1334.1700 1358.6778 1366.4518 1367.2569 1394.8820 1395.4982 1407.5678 1432.7241 1476.1595 1481.8044 1494.9998 1513.0508 1527.6968 1574.2557 1575.5891 1594.8913 1598.2735 1610.8902 3154.1251 3154.8935 3155.3180 3159.9152 3160.1422 3174.3498 3175.8186 3178.1059 3179.7940 3522.7895 3680.7133
redmass: 11.2237 7.7972 9.3984 3.7973 4.4817 8.2558 8.2440 6.9083 7.7026 9.4729 8.6645 6.6362 9.7075 7.7567 7.1508 5.0751 6.6442 4.9932 5.1837 3.3012 4.2309 3.0765 9.6252 5.9421 4.8273 3.4190 6.8263 2.7891 3.2136 5.5370 1.9453 9.4698 1.1483 4.6807 7.3747 7.0627 7.7166 7.9612 4.6613 7.3373 3.9327 4.7354 7.3404 1.6477 2.0784 1.5752 1.6066 1.8829 6.8751 7.4991 1.4708 1.3338 1.3333 1.3739 2.1039 1.4876 4.4786 3.8737 5.4464 2.7645 2.3453 4.1580 1.3857 1.5286 1.1254 1.1268 3.8981 5.5334 7.2955 1.2889 1.3043 3.2942 6.0937 3.7572 5.3884 4.6299 4.8177 4.0822 4.3200 2.8621 3.0669 2.5693 2.7057 9.6253 4.8715 2.9165 7.6351 7.6883 6.1741 6.2258 1.9119 1.0888 1.0886 1.0886 1.0921 1.0887 1.0964 1.0965 1.0976 1.0977 1.0442 1.1053
irintensity: 1.0320 1.2375 0.6233 0.1228 0.5220 1.1902 0.7431 0.2232 0.1445 1.4151 4.1574 2.4578 0.3046 1.5263 2.6691 2.2443 0.7726 0.3744 1.6270 0.9687 1.3711 3.2880 18.3580 30.9630 15.0517 6.4595 2.7465 4.6659 55.7763 18.4421 140.8912 10.7069 61.9395 33.5719 1.0269 2.4102 12.6424 6.2179 2.8459 6.0669 14.8229 8.1191 6.8560 32.1688 9.8106 0.3324 52.5146 23.2402 13.7325 24.2102 9.1362 0.1947 0.6542 2.8155 8.0638 10.4888 72.9343 29.9327 0.1083 52.3718 85.1440 21.0170 4.1247 6.2550 6.7317 6.4936 12.9115 56.9147 0.7970 6.6311 3.9988 59.6275 250.6246 97.5460 4.6078 23.1711 15.1847 24.4611 5.9285 28.6085 9.8061 58.3858 23.8772 113.5961 204.6675 93.4113 0.0777 3.3358 104.5411 42.3904 434.0234 3.1686 4.0105 1.7555 24.7212 0.5516 5.2142 4.0599 0.5316 1.7465 108.5292 76.0657
temp: 298.150 k
press: 1.00000 atm
elementType: 17 17 7 7 7 7 7 6 6 6 6 6 6 6 6 6 6 6 6 6 6 6 6 6 6 1 1 1 1 1 1 1 1 1 1 1
symmnumber: 1
zpe: 664134.2 jmol-1
zpe.correction: 0.252955 hartree
zpe.thermalcorrener: 0.273069 hartree
zpe.thermalcorrenthalpy: 0.274014 hartree
zpe.thermalcorrgfe: 0.202080 hartree
zpe.sumelectzpe: -1884.712415 hartree
zpe.sumelectthermal: -1884.692301 hartree
zpe.sumelectthermalent: -1884.691357 hartree
zpe.sumelectthermalfe: -1884.763291 hartree
dipole: 0.4773 3.9915 -0.9773
dipole: 4.1371
quadrupole: -164.5868 -165.4708 -152.2776
quadrupole: 17.2127 -5.8852 -8.3590
quadrupole: -3.8084 -4.6924 8.5008 17.2127 -5.8852 -8.3590
hfenergy: -1884.9653707 hartree
pointgroup: C01 [X(C18H11Cl2N5)]
dipole: -0.0741902 1.5074927 0.6092593 debye
polarizability: 421.2626398|-1.1095536|290.6773807|1.2826668|57.837006|145.3713134 unknown
InChI: InChI=1S/C18H11Cl2N5/c19-12-5-1-10(2-6-12)14-15(11-3-7-13(20)8-4-11)25-18-16(24-14)17(21)22-9-23-18/h1-9H,21H2
charge 0 multiplicity 1
36 atoms
Cl 3.999165 4.75354 0.378561
Cl 4.873338 -4.067328 -0.216571
N  -1.718622 1.083062 0.303165
N  -1.410184 -1.584139 -0.626178
N  -3.771112 -1.792466 -0.869307
N  -5.230209 0.015051 -0.047914
N  -4.329388 2.007487 0.838475
C  -0.478172 0.580408 0.070743
C  -0.330167 -0.830433 -0.297228
C  0.643528 1.556235 0.156074
C  0.966925 -1.566366 -0.280308
C  -2.801244 0.280222 0.059126
C  -2.668472 -1.037911 -0.499615
C  1.715976 1.545144 -0.776836
C  0.607325 2.577482 1.142884
C  1.990793 -1.284178 0.66441
C  1.148247 -2.648586 -1.183903
C  -4.150211 0.77166 0.291379
C  2.734897 2.518418 -0.718504
C  1.624953 3.549821 1.221822
C  3.177119 -2.046021 0.692571
C  2.334009 -3.40952 -1.176743
C  2.678478 3.503768 0.287165
C  3.335821 -3.092347 -0.237648
C  -4.967382 -1.212935 -0.618836
H  1.754159 0.784249 -1.562004
H  -0.226859 2.602142 1.850568
H  1.863749 -0.481375 1.396188
H  0.338959 -2.89266 -1.878215
H  3.553472 2.511821 -1.44355
H  1.600332 4.326464 1.991356
H  3.959172 -1.832697 1.426424
H  2.473675 -4.235005 -1.880146
H  -5.853901 -1.790514 -0.899852
H  -5.274454 2.360335 0.976168
H  -3.508912 2.577271 1.043477
