program: Gaussian 09
title: 000269775
version: EM64L-G09RevD.01
frameworkgroup: C1[X(C7H9NOS)]
method: RPBEPBE
basis: SDD
operation: Freq
keyword: #p
keyword: freq=noraman
keyword: PBEPBE/SDD
title: #p freq=noraman PBEPBE/SDD
converged: NO NO NO NO
title: Mulliken charges:
elementType: S O N C C C C C C C H H H H H H H H H
charge: -0.009802 -0.349086 0.046456 -0.479868 0.456552 -0.715696 -0.325619 -0.326241 -0.219899 -0.220163 0.236497 0.218715 0.273565 0.281075 0.241182 0.237916 0.280111 0.279852 0.094454
chargesum: 0.00000
title: Mulliken charges with hydrogens summed into heavy atoms:
elementType: S O N C C C C C C C
charge: 0.084652 -0.349086 0.046456 -0.024656 0.456552 -0.161056 -0.084437 -0.088325 0.060212 0.059688
polarizability: 1.72813264e+02 -1.33304317e+00 9.46566619e+01 -1.47232662e+01 2.77989637e+00 5.58995843e+01
1716.lowfreq: -5.4573 -0.0009 0.0005 0.0027 6.7846 26.2970 43.4639 64.8346 78.9619
frequency: 43.2751 64.8263 78.6793 174.9430 212.8319 238.2593 310.4474 358.2034 416.9669 456.1751 490.1185 526.4618 651.6788 664.0207 718.1396 736.8703 779.1218 819.7692 826.4192 831.5282 850.0159 937.7907 953.0484 1002.1146 1016.0157 1026.2591 1085.3814 1151.8081 1179.3480 1225.3077 1249.7325 1258.0612 1268.8461 1285.2254 1314.9207 1320.0457 1449.5692 1449.6934 1463.7528 1474.9146 1518.7916 1629.1846 2424.7570 2997.5059 3032.3324 3058.7840 3107.7830 3144.1399 3147.1046 3207.0930 3211.0787
redmass: 3.7780 8.5794 2.3013 5.9491 1.4623 2.8794 2.7108 5.5678 2.9648 5.0651 4.9442 3.2386 6.7964 3.9291 3.4851 1.2347 3.0988 1.2590 3.2465 1.4212 1.8580 1.3511 1.3430 1.8867 2.9002 3.0838 1.4801 1.0872 1.1855 2.2940 6.2756 1.2451 1.5722 2.1451 1.2578 1.3067 1.1247 2.9114 2.3563 1.0985 6.7125 6.0192 1.0383 1.0608 1.0584 1.1016 1.1078 1.0910 1.0912 1.0945 1.0970
irintensity: 2.2052 3.1657 2.6974 2.5255 12.8940 15.1049 1.2376 7.2778 0.0253 4.9505 15.5311 22.4358 0.2278 14.4219 0.8707 3.3121 24.8932 0.5687 23.5525 38.6000 13.5677 0.7592 0.0084 8.9064 6.3075 5.5123 3.2683 14.0981 45.3764 0.6847 104.0230 5.5612 2.1008 4.8080 2.6395 3.9083 2.5914 1.8833 88.8240 10.4803 1.3210 7.7421 28.8579 20.1690 21.5504 6.5981 12.0764 10.8534 3.6355 0.0591 0.0240
temp: 298.150 k
press: 1.00000 atm
elementType: 16 8 7 6 6 6 6 6 6 6 1 1 1 1 1 1 1 1 1
symmnumber: 1
zpe: 381842.9 jmol-1
zpe.correction: 0.145436 hartree
zpe.thermalcorrener: 0.155300 hartree
zpe.thermalcorrenthalpy: 0.156244 hartree
zpe.thermalcorrgfe: 0.108857 hartree
zpe.sumelectzpe: -799.371765 hartree
zpe.sumelectthermal: -799.361901 hartree
zpe.sumelectthermalent: -799.360957 hartree
zpe.sumelectthermalfe: -799.408344 hartree
dipole: -2.8373 0.9610 1.1893
dipole: 3.2231
quadrupole: -97.0986 -57.1140 -69.6029
quadrupole: -4.3475 0.0254 0.7576
quadrupole: -22.4934 17.4911 5.0023 -4.3475 0.0254 0.7576
hfenergy: -799.517201 hartree
pointgroup: C01 [X(C7H9N1O1S1)]
dipole: -1.1197338 -0.368376 -0.4674179 debye
dipolederiv: -0.4614298 -0.0631264 0.0502818 -0.1319987 0.077713 0.1351969 0.021147 0.1575843 -0.1979985 -1.2874274 -0.0077196 -0.1582732 -0.0050141 -0.3199171 -0.0005117 -0.2050802 -0.0013427 -0.3678521 1.2325218 0.0084997 0.2099575 0.0099878 0.0440291 0.0011548 0.2506867 0.0013782 0.1576437 -0.1408479 -0.0105605 0.0497362 0.0246889 0.1142063 0.0095771 0.1125504 0.0197604 0.0765849 0.1729604 -0.0012347 0.0272979 -0.0082125 -0.1635186 -0.0012488 0.1374896 -0.0005428 -0.1114863 0.5698242 -0.0225758 -0.0225867 0.1044136 0.0731784 -0.0003168 -0.0937494 -0.0353922 0.1008923 0.0349462 0.067431 0.0474598 -0.0451406 0.1258893 -0.016116 0.0394414 0.01559 -0.0870814 0.0383072 -0.0727067 0.0461371 0.0472832 0.1241216 0.016662 0.0351818 -0.0127091 -0.0894397 -0.2000419 -0.0158288 -0.0075679 0.3508899 0.0721159 0.0628018 -0.0256507 -0.0036468 -0.1293688 -0.1983878 0.0137997 -0.0075218 -0.358846 0.0661476 -0.0610452 -0.0296662 0.0042399 -0.130393 0.0201625 0.0214782 -0.0319811 0.0423682 -0.0388384 0.1043156 -0.0296377 0.0585339 0.0161814 -0.0037202 -0.0241685 -0.0359949 -0.0675084 -0.0586489 -0.1181367 -0.0327725 -0.0603566 0.0145205 -0.0590887 0.0665523 -0.0526309 0.0436496 -0.0339697 0.1068987 -0.007619 0.052587 0.0048453 0.0314609 -0.0475997 -0.0272439 -0.0153591 -0.0088242 -0.0980501 -0.0134361 -0.0581596 0.0330292 0.0733289 0.0931036 -0.0235578 0.0753373 -0.0232659 0.0135192 -0.0170629 0.0176914 0.1356164 0.071763 -0.0943719 -0.0252666 -0.0763999 -0.0294883 -0.0154696 -0.0166391 -0.0211958 0.1346894 0.0399361 -0.0468543 -0.0275669 -0.0059779 0.0447717 -0.0019606 -0.0338848 -0.0088176 0.1794938 0.0389111 0.0466502 -0.0274071 0.0067413 0.0443971 0.0006387 -0.0352298 0.0073302 0.179593 0.0268211 0.0892321 0.0167285 0.0090975 -0.1100988 -0.1379094 -0.0560687 -0.1325321 0.08053 unknown
polarizability: 173.0621523|1.1537837|94.4949145|13.7034053|3.7798754|55.8124437 unknown
InChI: InChI=1S/C7H9NOS/c9-8-4-1-7(2-5-8)3-6-10/h1-2,4-5,10H,3,6H2
charge 0 multiplicity 1
19 atoms
S  -4.629503 0.073033 0.342471
O  3.652213 0.016264 0.47451
N  2.351449 0.009267 0.192266
C  -1.940847 -0.010288 -0.693985
C  -0.448131 -0.005561 -0.419886
C  -2.756518 -0.024421 0.623825
C  0.278148 1.204359 -0.254193
C  0.293093 -1.207414 -0.26428
C  1.644144 1.20494 0.042768
C  1.659261 -1.1936 0.032751
H  -2.234599 0.881375 -1.2772
H  -2.217135 -0.897735 -1.294969
H  -2.535399 -0.922462 1.224434
H  -2.530866 0.864119 1.23688
H  -0.221782 2.172988 -0.364254
H  -0.194057 -2.181644 -0.382764
H  2.252441 2.100732 0.174261
H  2.278552 -2.082813 0.157419
H  -4.742667 -1.14814 -0.307552
