program: Gaussian 09
title: 000269770
version: EM64L-G09RevD.01
frameworkgroup: C1[X(C9H12ClN)]
method: RPBEPBE
basis: SDD
operation: Freq
keyword: #p
keyword: freq=noraman
keyword: PBEPBE/SDD
title: #p freq=noraman PBEPBE/SDD
converged: YES YES NO NO
title: Mulliken charges:
elementType: Cl N C C C C C C C C C H H H H H H H H H H H H
charge: -0.087844 -0.062014 0.216251 -0.498131 0.469798 -0.462375 0.149461 -0.474470 -0.562890 -0.804722 -0.789053 0.239129 0.228163 0.242778 0.238835 0.261082 0.290143 0.239461 0.226632 0.234284 0.250332 0.226702 0.228450
chargesum: 0.00000
title: Mulliken charges with hydrogens summed into heavy atoms:
elementType: Cl N C C C C C C C C C
charge: -0.087844 -0.062014 0.216251 -0.030839 0.469798 -0.219596 0.149461 -0.235635 -0.011665 -0.104346 -0.083569
polarizability: 1.24248454e+02 3.38013097e-01 1.22978118e+02 -1.35983222e+01 1.34414810e+00 8.19348122e+01
1716.lowfreq: -12.8408 -8.9277 -0.0030 -0.0029 -0.0023 8.3403 14.8024 23.6471 30.3542
frequency: 12.1645 22.4198 30.2015 53.3120 144.1034 180.8875 189.6686 225.7110 263.3475 299.1272 371.9269 450.0674 508.6674 523.0720 536.4555 565.2440 594.8819 624.7773 749.4865 857.4817 880.6440 899.7448 913.6135 934.9300 967.7877 972.5287 1013.3185 1021.4383 1046.3572 1050.2883 1052.1181 1130.5738 1161.4152 1191.6260 1223.3919 1288.5902 1311.7408 1316.3128 1361.9062 1389.6328 1395.8728 1401.5924 1424.8007 1442.6097 1443.9698 1465.8928 1467.8374 1470.4217 1473.2320 1566.4438 1604.2348 2980.9914 2981.9508 2982.8281 3058.0335 3060.7763 3061.6661 3068.7244 3090.3133 3114.8081 3131.0537 3138.8569 3148.0998
redmass: 1.7431 1.6228 1.0448 8.3302 3.0334 2.9301 3.8443 4.4891 2.5099 2.1319 3.2833 2.6167 5.5906 3.9588 3.1622 4.2497 5.4427 2.8080 2.8945 1.4061 2.1515 1.6746 2.0461 2.0005 2.7323 2.9131 1.5375 1.9367 1.5554 1.6527 2.3473 1.1750 1.3972 1.2906 1.4310 1.3961 2.7726 1.9762 2.7470 1.3111 1.3310 2.4643 2.2461 1.1320 1.2348 1.1770 1.0456 1.0472 1.1527 6.0489 5.7699 1.0374 1.0634 1.0384 1.0623 1.0973 1.0974 1.0904 1.0993 1.0982 1.0924 1.0930 1.1117
irintensity: 0.4068 2.3808 0.1880 1.7465 4.2290 1.6379 1.1948 2.0343 0.7629 2.2938 14.1336 1.1289 2.9727 3.9124 1.9168 1.9863 24.7460 1.8893 6.3337 9.6778 6.7575 10.1279 4.9480 17.0838 3.7026 4.2080 1.6771 1.8921 0.0063 24.7999 3.8626 4.5125 0.2850 6.8885 2.4088 20.0776 3.8730 0.5583 1.5735 26.8173 10.2511 4.4700 9.5557 21.7070 9.5286 33.9893 17.5456 10.8557 41.0622 64.9787 91.4556 25.6273 17.1543 18.4943 26.0074 15.9717 19.8793 17.8370 18.4366 10.0242 17.8679 6.9195 12.7754
temp: 298.150 k
press: 1.00000 atm
elementType: 17 7 6 6 6 6 6 6 6 6 6 1 1 1 1 1 1 1 1 1 1 1 1
symmnumber: 1
zpe: 492299.0 jmol-1
zpe.correction: 0.187507 hartree
zpe.thermalcorrener: 0.199601 hartree
zpe.thermalcorrenthalpy: 0.200545 hartree
zpe.thermalcorrgfe: 0.145238 hartree
zpe.sumelectzpe: -864.153734 hartree
zpe.sumelectthermal: -864.141640 hartree
zpe.sumelectthermalent: -864.140695 hartree
zpe.sumelectthermalfe: -864.196002 hartree
dipole: 2.2170 -0.5753 1.3530
dipole: 2.6602
quadrupole: -69.4451 -68.6872 -73.6840
quadrupole: -3.9333 -8.2238 -1.8424
quadrupole: 1.1604 1.9182 -3.0786 -3.9333 -8.2238 -1.8424
hfenergy: -864.3412407 hartree
pointgroup: C01 [X(C9H12Cl1N1)]
dipole: -0.5820063 0.3559814 -0.7936822 debye
dipolederiv: -0.2127933 -0.0601182 0.0319779 0.0333603 -0.5037799 0.223008 -0.053148 0.1514785 -0.3152271 -0.5828141 0.1456948 0.0369665 0.1271362 -0.4583526 -0.0953227 0.0582436 -0.1206138 -0.3103076 0.6685427 -0.1850258 0.0469405 0.0278431 0.1363042 0.0549585 0.0795847 0.0730299 0.0327041 -0.0599578 -0.002754 -0.0077731 -0.0145473 0.0003057 0.1036277 -0.1477086 0.0939576 -0.0498718 0.3569672 0.0985346 0.1095438 0.1108224 0.271407 0.1963704 0.0875743 0.1927417 0.1453283 -0.4986914 -0.0228687 -0.1102754 -0.1606284 -0.0731197 0.0226581 -0.1011371 0.0092542 -0.1385149 0.2329367 -0.0646406 -0.0271361 -0.19657 0.5213038 0.3047226 -0.1365813 0.3437796 0.2519643 -0.0384505 -0.1151454 -0.0925778 -0.0075558 -0.4171517 -0.1723179 0.0057871 -0.1898729 -0.2927039 0.1568804 0.1108693 -0.0465804 0.0215821 0.6311788 -0.2784509 0.1025149 -0.2983888 0.3410227 0.0138148 -0.063947 -0.0518815 -0.1379088 -0.0780656 -0.0938048 -0.091696 -0.0815187 -0.0177663 -0.0263518 0.1316937 0.0843372 0.087534 -0.1442763 -0.1310491 0.0562813 -0.1291069 -0.0351172 0.0332361 0.0224996 -0.0282351 0.0735022 0.0003868 -0.1270405 0.0343248 -0.0858564 -0.0178297 -0.0115272 -0.020911 -0.0076469 -0.0978304 -0.039257 0.0759267 0.0048931 0.0850553 0.0468468 0.0790488 0.0442968 0.0386041 0.0631298 -0.0117921 -0.1025616 0.0415274 -0.0978397 0.081651 -0.1127818 0.0543194 0.0109396 0.0323511 0.1092884 -0.0291159 0.0046454 -0.027712 0.1316201 -0.1742016 -0.015625 -0.0248883 0.0046481 -0.0129752 0.0590961 -0.0258395 0.0633384 0.0622932 0.1341671 -0.0088041 0.0831288 -0.0260954 -0.0509314 -0.0477815 0.0468669 -0.0069539 -0.0022549 0.0621296 0.0111916 -0.0463627 -0.0306081 -0.1064569 0.0399083 -0.0136456 0.0726138 0.0816083 -0.1283052 0.019821 -0.0120707 0.1089044 0.066644 -0.0194103 0.0549233 -0.0288557 0.0928807 0.05356 -0.0308989 0.0481092 -0.019361 0.1014396 -0.0095197 -0.0082697 -0.0386757 -0.130394 -0.0151373 -0.1211122 -0.0932987 -0.037692 0.0607579 -0.0423932 -0.0369969 -0.0486175 0.0741029 0.0477744 0.0981472 -0.0616333 0.0850321 -0.0446826 0.0235249 -0.0723102 0.0847422 0.0107927 0.0219543 -0.0252172 0.1198127 -0.0470488 0.0418248 0.044967 0.1101661 -0.0159791 -0.0428279 unknown
polarizability: 126.7251264|-4.601847|113.9143173|6.5957787|17.9868577|88.5219405 unknown
InChI: InChI=1S/C9H12ClN/c1-7-5-8(2)11-9(6-7)3-4-10/h5-6H,3-4H2,1-2H3
charge 0 multiplicity 1
23 atoms
Cl 2.293656 -2.443121 1.672732
N  0.299365 0.877997 0.474603
C  0.712917 -0.198832 -0.268738
C  2.2158 -0.420138 -0.306106
C  -1.58578 -0.790231 -0.867979
C  -0.19022 -1.044814 -0.944265
C  -1.039463 1.134893 0.559557
C  -2.000119 0.322338 -0.101736
C  2.808098 -0.7156 1.075532
C  -2.581756 -1.687302 -1.576197
C  -1.460585 2.330306 1.390927
H  2.481209 -1.224345 -1.01393
H  2.695427 0.515218 -0.66142
H  0.187635 -1.90114 -1.513553
H  -3.065316 0.563815 -0.009698
H  3.907849 -0.737102 1.065807
H  2.424856 -0.014999 1.831423
H  -2.511159 -2.726683 -1.204751
H  -3.618727 -1.342341 -1.425709
H  -2.3866 -1.718495 -2.664371
H  -0.568889 2.81948 1.812389
H  -2.015615 3.068079 0.781651
H  -2.124783 2.026716 2.221631
