program: Gaussian 09
title: 000269761
version: EM64L-G09RevD.01
frameworkgroup: C1[X(C9H12ClN)]
method: RPBEPBE
basis: SDD
operation: Freq
keyword: #p
keyword: freq=noraman
keyword: PBEPBE/SDD
title: #p freq=noraman PBEPBE/SDD
converged: YES YES NO NO
title: Mulliken charges:
elementType: Cl N C C C C C C C C C H H H H H H H H H H H H
charge: -0.083306 -0.027567 0.500092 0.192022 -0.531205 -0.443616 -0.319951 -0.348116 -0.550994 -0.576980 -0.671505 0.213286 0.213713 0.226723 0.247884 0.243993 0.239861 0.249453 0.295362 0.261740 0.220820 0.222572 0.225720
chargesum: 0.00000
title: Mulliken charges with hydrogens summed into heavy atoms:
elementType: Cl N C C C C C C C C C
charge: -0.083306 -0.027567 0.500092 0.192022 -0.104206 0.030991 -0.075957 -0.108255 -0.301542 -0.019878 -0.002392
polarizability: 1.68082246e+02 -4.75307563e+00 9.68579785e+01 3.95856641e+00 8.13869274e+00 7.07920512e+01
1716.lowfreq: -5.9793 0.0015 0.0021 0.0032 1.6131 7.9557 24.9928 35.4790 62.3058
frequency: 24.7641 35.4453 62.3017 70.1226 134.6734 209.5706 215.7626 238.1198 300.4089 381.3058 396.7815 423.1638 479.8994 569.5382 634.9380 670.1092 723.2148 775.6728 784.8608 791.1379 827.8726 856.7734 934.6405 965.0959 975.9980 987.0954 1009.3672 1049.2434 1055.4310 1064.7319 1111.8198 1145.5680 1218.6592 1229.5961 1241.9488 1252.7060 1265.6675 1301.2584 1310.6324 1315.1756 1336.3148 1382.8882 1389.8720 1455.1654 1463.5503 1469.5876 1473.9492 1476.4248 1489.3578 1557.7004 1591.8662 2981.7714 2988.2354 3010.3962 3039.7643 3062.6042 3074.2941 3081.7947 3085.3168 3110.1907 3123.4924 3151.9009 3154.4988
redmass: 3.2371 3.2580 3.2440 3.2112 4.0210 1.2277 4.9072 4.6938 2.0156 2.6256 3.2020 4.2889 3.8069 3.3543 7.7121 5.0412 3.4280 1.4665 1.1810 2.4033 3.0897 1.7697 1.4050 2.4232 1.4200 1.5523 2.6156 2.5212 2.0021 2.0349 1.1863 1.2115 3.2635 1.5455 1.3163 1.3242 1.4190 1.3871 3.3513 1.5157 1.5923 2.1424 1.1950 1.0862 1.2670 1.4694 1.0691 1.2817 1.1073 5.6446 6.2939 1.0348 1.0602 1.0604 1.1015 1.0586 1.1004 1.1002 1.1012 1.0915 1.0891 1.0980 1.1100
irintensity: 0.4550 0.6564 0.1899 2.2650 2.0688 0.1265 0.5145 4.7235 1.6360 1.9709 1.0898 5.6295 8.5983 16.7539 1.5432 56.7049 2.3702 4.0801 1.8944 7.8286 9.1977 23.6412 3.3916 6.6355 0.4317 4.2536 4.5338 9.3222 3.0825 15.9560 1.6311 5.4758 1.9649 5.9286 2.1708 3.5388 1.5815 3.1796 10.4633 0.9353 8.2448 19.8673 9.3306 2.0133 33.4795 15.0044 16.9181 19.0081 19.4638 15.2779 6.2164 35.0264 34.9485 10.7064 6.8358 16.5999 9.8899 53.0893 38.4646 28.6460 15.2148 8.6935 13.7293
temp: 298.150 k
press: 1.00000 atm
elementType: 17 7 6 6 6 6 6 6 6 6 6 1 1 1 1 1 1 1 1 1 1 1 1
symmnumber: 1
zpe: 496402.4 jmol-1
zpe.correction: 0.189070 hartree
zpe.thermalcorrener: 0.200542 hartree
zpe.thermalcorrenthalpy: 0.201486 hartree
zpe.thermalcorrgfe: 0.149037 hartree
zpe.sumelectzpe: -864.142574 hartree
zpe.sumelectthermal: -864.131102 hartree
zpe.sumelectthermalent: -864.130158 hartree
zpe.sumelectthermalfe: -864.182607 hartree
dipole: 4.6597 1.5367 0.8339
dipole: 4.9769
quadrupole: -79.0257 -69.7803 -74.8697
quadrupole: -2.1841 0.5552 0.5425
quadrupole: -4.4671 4.7783 -0.3111 -2.1841 0.5552 0.5425
hfenergy: -864.331644 hartree
pointgroup: C01 [X(C9H12Cl1N1)]
dipole: 1.8049586 0.7573297 0.051555 debye
dipolederiv: -0.8149251 -0.0627243 0.0811837 -0.0420478 -0.1917896 0.0143406 0.0373252 0.0088708 -0.2120763 -0.5201662 -0.0201343 -0.0138254 0.0770733 -0.3066656 0.0031522 0.0020457 -0.0036318 -0.2299445 0.3139779 -0.0852343 0.0814937 0.0679036 -0.2313675 -0.0091166 0.0521805 -0.0042513 -0.0248658 0.6922233 -0.0334435 0.0011807 0.0806984 0.0558938 0.0338998 0.174049 0.0229671 -0.0283486 0.0288129 0.0062181 -0.0535448 -0.0536365 0.1545506 -0.012262 -0.1882991 0.0029148 0.0538227 -0.3084307 -0.0390984 0.0613107 -0.139403 0.1151786 0.0320615 -0.0221968 0.0303199 0.0054798 0.0339818 0.0189355 -0.0033348 0.0896737 0.1466369 0.0073169 -0.0055652 -0.0059217 -0.122222 -0.3433458 -0.016557 0.0080355 -0.1757164 0.0296919 -0.0242162 0.0029928 -0.00638 -0.111065 0.0181176 0.0594648 -0.0094105 -0.229027 0.3257159 -0.0100971 0.0068897 -0.0150858 -0.0849666 0.9564197 0.0731482 -0.0471428 0.1587601 0.1705147 0.0092 -0.1532829 0.0154836 0.2162621 -0.030186 0.0043046 -0.0408394 0.0241199 0.07488 -0.0059379 0.0736927 -0.0200906 0.013963 0.0226616 0.0103616 -0.0066172 0.0944618 -0.1118571 -0.1007639 0.0088873 -0.0656946 0.0293068 -0.0430129 -0.0312645 0.0401219 -0.0878227 -0.015381 0.1193661 0.066153 0.0755743 -0.0300729 0.0506171 0.0163456 -0.0034989 0.0613468 -0.1159847 0.0410751 0.0301757 0.0205189 0.0772053 0.0096705 -0.0115711 -0.0508803 -0.0276916 0.0545895 -0.0764868 -0.0322383 -0.0479845 -0.0381796 -0.0000159 -0.1072979 0.0074701 -0.1038888 -0.0178992 -0.0025987 -0.0009452 -0.002912 0.1321885 0.0421926 0.0911775 -0.0143436 0.0925393 -0.0573532 0.0128399 -0.004885 0.0137455 0.1494601 0.0117056 0.0929013 0.0014123 0.1140849 -0.0616597 0.0098792 -0.0027909 0.0097333 0.1190902 -0.0001161 0.0482611 -0.0239747 0.0095605 -0.0371017 0.0363462 -0.0167702 0.0046308 0.0882558 -0.0395987 -0.0304356 -0.0537047 -0.0198173 0.0457941 -0.087577 -0.0060563 -0.0532692 -0.0688949 0.0959389 0.0734238 0.0208484 0.0397045 -0.1146982 -0.0974045 0.0104925 -0.0425332 0.0353597 -0.2425278 0.034513 -0.0593374 0.032469 0.104978 -0.002411 -0.0738639 -0.0003916 0.0526606 0.0660057 -0.0912943 0.0773974 -0.0633448 -0.0166666 0.1093943 0.0420095 0.0633872 -0.0224186 unknown
polarizability: 168.3655617|-0.1687376|98.7637602|3.8916515|-2.7990777|68.6029536 unknown
InChI: InChI=1S/C9H12ClN/c1-2-8-3-4-9(5-6-10)11-7-8/h3-4,7H,2,5-6H2,1H3
charge 0 multiplicity 1
23 atoms
Cl -4.932081 -0.379468 0.586955
N  -0.33706 -1.025603 -0.335181
C  1.904785 -0.013855 -0.246902
C  -0.894056 0.226225 -0.40312
C  3.406662 -0.202254 -0.119761
C  -2.412754 0.282831 -0.488975
C  1.311201 1.271375 -0.320593
C  -0.093023 1.395202 -0.397114
C  1.01951 -1.123588 -0.26025
C  -3.043969 -0.389095 0.738365
C  3.902166 -0.02018 1.340412
H  3.686459 -1.212421 -0.474478
H  3.931828 0.521466 -0.77264
H  -2.756848 1.328762 -0.568489
H  -2.748108 -0.252903 -1.396205
H  1.943529 2.167553 -0.322589
H  -0.565939 2.380884 -0.457728
H  1.41967 -2.145116 -0.215096
H  -2.749342 -1.44478 0.8120
H  -2.825446 0.145569 1.674917
H  3.658219 0.989365 1.718255
H  4.997148 -0.155346 1.40331
H  3.42475 -0.755021 2.013307
