program: Gaussian 09
title: 000025714
version: EM64L-G09RevD.01
frameworkgroup: C1[X(C10H8N2O2)]
method: RPBEPBE
basis: SDD
operation: Freq
keyword: #p
keyword: freq=noraman
keyword: PBEPBE/SDD
title: #p freq=noraman PBEPBE/SDD
converged: NO YES YES YES
title: Mulliken charges:
elementType: O O N N C C C C C C C C C C H H H H H H H H
charge: -0.211787 -0.263021 0.026583 -0.670836 0.434733 0.460140 -0.600575 -0.635201 0.232126 0.370784 -0.406227 -0.424966 -0.247997 -0.227257 0.292560 0.234775 0.251677 0.245002 0.234392 0.231372 0.363218 0.310505
chargesum: 0.00000
title: Mulliken charges with hydrogens summed into heavy atoms:
elementType: O O N N C C C C C C C C C C
charge: -0.211787 -0.263021 0.026583 0.002887 0.434733 0.460140 -0.308015 -0.400426 0.232126 0.370784 -0.154550 -0.179963 -0.013605 0.004114
polarizability: 2.38784567e+02 -6.23523306e+00 1.54830573e+02 1.14242460e-02 6.20253978e-03 4.95630695e+01
1716.lowfreq: -11.4007 0.0003 0.0010 0.0011 5.7469 6.9130 68.9177 89.7148 126.0574
frequency: 68.9159 89.7145 126.0572 203.5249 242.4016 293.3701 328.1130 352.9400 385.7051 413.2645 446.1453 466.4863 487.1808 541.2000 553.8798 590.9983 622.2624 637.9955 693.7907 720.0896 723.7652 747.2345 759.4876 774.1439 817.9806 844.4019 891.5554 904.5926 934.6533 971.2357 992.2369 1015.4052 1040.7744 1065.3979 1137.5643 1171.8560 1182.2790 1215.5929 1241.0384 1281.3519 1306.6563 1335.0634 1371.7962 1414.3084 1431.9871 1452.6585 1478.6129 1519.7215 1563.4842 1583.7300 1614.1074 1646.2650 3123.9511 3125.5687 3131.8492 3147.3529 3166.6174 3167.7625 3434.5002 3652.3804
redmass: 9.1043 6.1617 4.8843 7.0878 4.4549 4.4720 5.3374 5.7935 6.0936 3.0904 7.6347 2.0207 1.4043 3.5532 4.5872 7.0396 6.6856 4.5794 1.2143 4.3033 7.2720 7.4505 1.2891 2.5555 4.3382 1.3820 1.7464 5.2933 1.4818 1.4215 1.3463 2.3671 3.8578 1.5417 1.6094 1.3581 2.4150 1.6790 1.6382 1.7280 3.9839 4.2920 2.0803 6.5433 3.0275 4.3845 3.3122 3.9513 6.2782 1.3628 5.0859 7.2307 1.0896 1.0874 1.0888 1.0956 1.0994 1.0923 1.0526 1.0973
irintensity: 0.2532 0.4965 2.1996 1.9101 0.3697 0.3851 3.3609 4.1196 0.6069 8.3249 0.1303 0.6562 175.5069 1.2199 0.0706 6.3689 2.1955 6.9744 95.1759 20.2757 12.0029 0.5500 78.2259 0.5183 7.1473 17.3784 41.3711 0.2268 13.8439 16.1068 0.0278 1.5943 9.0790 31.9556 3.7529 146.2395 287.6915 68.1064 2.3331 0.8924 77.8358 59.0513 82.4085 27.9833 7.2938 19.3822 14.5282 30.9899 18.3921 111.2121 138.5315 297.7316 4.2623 10.8623 0.0442 29.2642 24.9866 9.5622 107.8444 55.8137
temp: 298.150 k
press: 1.00000 atm
elementType: 8 8 7 7 6 6 6 6 6 6 6 6 6 6 1 1 1 1 1 1 1 1
symmnumber: 1
zpe: 428532.0 jmol-1
zpe.correction: 0.163219 hartree
zpe.thermalcorrener: 0.173957 hartree
zpe.thermalcorrenthalpy: 0.174902 hartree
zpe.thermalcorrgfe: 0.126657 hartree
zpe.sumelectzpe: -644.781806 hartree
zpe.sumelectthermal: -644.771068 hartree
zpe.sumelectthermalent: -644.770124 hartree
zpe.sumelectthermalfe: -644.818368 hartree
dipole: 4.0015 3.4744 0.0011
dipole: 5.2994
quadrupole: -85.4786 -68.6862 -84.9627
quadrupole: -10.9814 -0.0032 0.0017
quadrupole: -5.7694 11.0230 -5.2536 -10.9814 -0.0032 0.0017
hfenergy: -644.9450252 hartree
pointgroup: C01 [X(C10H8N2O2)]
dipole: 1.5799745 1.3604069 0.0004271 debye
dipolederiv: -0.5743728 -0.1383214 -0.0000332 -0.4653406 -0.9597404 -0.0000598 -0.0000439 -0.0000122 -0.2317429 -1.0416535 0.089491 -0.0000711 0.3044072 -0.4400414 0.0000595 -0.0000428 -0.0000034 -0.2746497 2.025291 0.3900574 0.0002056 0.5239919 1.2425861 0.000031 0.0002168 0.0000265 0.1964472 -1.0064717 0.6396232 -0.0000263 0.6843962 -0.7652809 -0.0000171 -0.0000722 0.0000609 -0.6463864 -0.5424474 -0.3131457 -0.0000577 -0.0997425 -0.2474391 -0.0000256 -0.0000474 -0.0000437 0.0100692 0.4870263 -0.4032785 -0.0000054 -0.0044659 0.2028235 0.0000107 0.000024 -0.0000082 0.0801351 0.7544475 0.3074046 0.0000762 -0.2667034 -0.0915265 -0.0000205 0.0000633 0.0000388 -0.0979888 -0.6347212 0.6133576 0.0000287 0.0163999 0.0749261 0.0000302 0.0000203 0.0000241 -0.2489246 -1.127187 -0.44191 -0.0001161 0.0901197 -0.2017796 -0.0000109 -0.000101 -0.000043 0.0011537 1.1029825 -0.8821488 -0.0000253 -0.4443868 0.5455255 0.0000441 -0.0000745 0.0000279 0.144771 0.3417528 0.1890859 0.0000426 -0.190927 0.0850563 0. 0.000014 0.0000232 -0.1507895 -0.2737267 0.3038156 0.0000182 0.1167842 0.0708104 0.0000207 -0.000001 0.0000414 -0.1917994 -0.2430159 -0.2591954 -0.0000219 -0.2418245 -0.1457801 -0.0000158 -0.0000131 -0.0000118 -0.1813573 0.1239624 0.0263126 0.0000138 0.1393963 0.2935178 0.0000373 0.0000185 0.0000255 -0.1330001 0.1148546 -0.0122822 -0.0000033 0.0085515 0.0460952 -0.0000091 -0.0000041 -0.0000064 0.1627704 0.0480586 -0.0124098 -0.0000086 -0.0025612 -0.1038466 -0.0000226 0.0000034 -0.0000359 0.1678071 0.0729911 -0.070436 -0.0000083 0.0141289 -0.073495 -0.0000119 -0.0000037 -0.000017 0.1574089 0.0642026 0.0132693 -0.0000046 -0.0724936 -0.0995783 -0.0000193 -0.0000084 -0.0000137 0.1603885 -0.0518969 0.102106 -0.0000071 0.107482 0.0004127 -0.0000033 -0.0000064 -0.0000036 0.1688228 -0.1172076 -0.0706327 -0.0000187 -0.0692568 0.0719088 -0.0000086 -0.00002 -0.0000111 0.1577277 0.2960501 0.0119603 0.0000084 -0.0578909 0.2814244 0.0000058 0.0000531 -0.0000088 0.3780968 0.1810812 -0.0827229 0.0000143 -0.0900645 0.2134213 -0.0000149 0.0000252 -0.0000496 0.3710404 unknown
polarizability: 238.731499|-6.5825971|154.8836412|0.0114498|0.0061552|49.5630695 unknown
InChI: InChI=1S/C10H8N2O2/c11-9-5-7-3-1-2-4-8(7)6-10(9)12(13)14/h1-6H,11H2
charge 0 multiplicity 1
22 atoms
O  -2.871212 -2.06122 -0.000342
O  -3.7711 0.026165 -0.000455
N  -2.736143 -0.776339 -0.000354
N  -2.204668 2.145547 0.000021
C  1.027294 -0.656589 -0.000042
C  1.277893 0.777294 0.000052
C  -0.315595 -1.10715 -0.000151
C  0.181184 1.676638 0.00004
C  -1.388447 -0.200946 -0.000167
C  -1.166121 1.239708 -0.00005
C  2.137023 -1.571272 -0.000033
C  2.643231 1.232176 0.000153
C  3.445989 -1.096398 0.000066
C  3.696203 0.319235 0.000158
H  -0.54713 -2.176375 -0.000247
H  0.379844 2.755465 0.000128
H  1.933304 -2.648343 -0.000105
H  2.843893 2.309758 0.000225
H  4.289991 -1.793666 0.000075
H  4.731187 0.679031 0.000233
H  -3.162433 1.781225 0.0002
H  -2.009387 3.143457 0.000095
