program: Gaussian 09
title: 000269751
version: EM64L-G09RevD.01
frameworkgroup: C1[X(C7H10N2O2S)]
method: RPBEPBE
basis: SDD
operation: Freq
keyword: #p
keyword: freq=noraman
keyword: PBEPBE/SDD
title: #p freq=noraman PBEPBE/SDD
converged: YES YES NO NO
title: Mulliken charges:
elementType: S O O N N C C C C C C C H H H H H H H H H H
charge: -0.026347 -0.249444 -0.247237 -0.398878 -0.390343 0.140811 -0.451600 0.260731 0.126905 -0.736443 -0.786509 0.132179 0.254620 0.220586 0.266133 0.302027 0.347121 0.262844 0.252374 0.251810 0.363307 0.105352
chargesum: 0.00000
title: Mulliken charges with hydrogens summed into heavy atoms:
elementType: S O O N N C C C C C C C
charge: 0.079005 -0.249444 -0.247237 -0.051757 -0.027036 0.140811 0.023605 0.260731 0.126905 -0.168282 -0.019481 0.132179
polarizability: 1.58995924e+02 -9.48456447e+00 1.17914128e+02 1.05485906e+01 -4.82835612e+00 6.46510965e+01
1716.lowfreq: -7.7557 -0.0024 -0.0019 -0.0018 5.6273 6.7385 28.9900 55.2055 65.9792
frequency: 28.3128 55.2001 65.9703 84.3862 141.2293 168.7141 177.7529 203.2263 230.0074 311.0561 330.7336 365.1037 382.2461 487.7922 504.8576 545.7317 592.7112 597.8673 630.5501 670.7937 704.1877 728.5088 740.0417 774.7466 796.7982 825.0323 943.4786 957.4813 1018.7087 1032.3328 1048.6531 1082.5538 1168.2322 1177.8089 1221.8595 1250.9096 1270.9545 1296.8068 1328.6898 1354.5243 1386.2336 1404.0071 1444.8616 1449.6346 1457.5244 1473.3342 1483.0788 1608.4278 1647.8395 1681.9350 2437.4516 2984.0928 3014.2913 3035.6885 3056.7718 3072.3626 3113.5965 3133.7323 3530.2720 3550.7463
redmass: 3.8209 5.9068 1.4001 1.7454 5.0008 8.7944 3.5958 1.5535 2.4873 3.6339 2.4729 8.3592 6.5808 6.4626 6.7918 3.6535 3.8789 7.3482 1.2628 3.6210 2.1957 1.2015 3.7564 2.3356 3.2157 1.4356 2.5104 2.3560 2.8501 2.0737 1.6306 1.9582 2.3768 1.9374 4.4021 1.1978 1.8611 1.4702 1.3413 1.8494 2.4750 1.2610 1.0797 1.7914 1.2674 1.1207 1.1484 6.8313 6.5112 5.4830 1.0383 1.0406 1.0603 1.0580 1.0978 1.1017 1.1078 1.0949 1.0772 1.0778
irintensity: 2.7150 0.4043 1.6990 1.9206 0.2687 2.9189 0.6863 14.3375 16.7907 1.2095 2.8415 18.8923 9.3934 14.3288 14.5255 2.1287 1.5696 4.1890 68.9567 17.0196 2.8924 7.6776 31.2498 109.8820 29.4623 10.4382 7.1067 2.1810 4.5305 1.0935 3.5676 5.2738 34.6161 13.0012 17.9911 2.6592 28.5580 22.8936 24.4753 27.6598 79.5219 47.1917 4.2391 67.5232 36.7470 11.0775 9.2532 149.0446 260.1780 756.5570 21.6217 17.5255 9.9862 21.1457 10.5112 3.5140 8.9411 9.0288 59.8644 68.7864
temp: 298.150 k
press: 1.00000 atm
elementType: 16 8 8 7 7 6 6 6 6 6 6 6 1 1 1 1 1 1 1 1 1 1
symmnumber: 1
zpe: 438206.7 jmol-1
zpe.correction: 0.166904 hartree
zpe.thermalcorrener: 0.179570 hartree
zpe.thermalcorrenthalpy: 0.180514 hartree
zpe.thermalcorrgfe: 0.126298 hartree
zpe.sumelectzpe: -929.891014 hartree
zpe.sumelectthermal: -929.878349 hartree
zpe.sumelectthermalent: -929.877405 hartree
zpe.sumelectthermalfe: -929.931621 hartree
dipole: -0.1621 4.1750 0.5555
dipole: 4.2149
quadrupole: -102.1389 -72.9661 -79.2239
quadrupole: -5.7561 0.3550 0.4654
quadrupole: -17.3626 11.8102 5.5524 -5.7561 0.3550 0.4654
hfenergy: -930.0579183 hartree
pointgroup: C01 [X(C7H10N2O2S1)]
dipole: 0.0303252 1.6385486 -0.2530746 debye
dipolederiv: -0.4010226 -0.0971179 0.0481638 -0.1476517 0.0399963 0.1342126 -0.0007353 0.158332 -0.2030788 -0.6930185 -0.1939426 -0.043903 -0.3093871 -1.1076719 -0.0677672 -0.0361225 -0.0319174 -0.3645138 -1.5268602 0.0328636 -0.1750055 0.0697635 -0.4837897 0.0081224 -0.2111817 0.0067185 -0.4218125 -1.2805252 -0.1172265 -0.1267186 0.6433653 -0.619244 0.1069021 -0.2063103 -0.0227557 -0.3184748 -1.1730771 -0.273813 -0.1342465 -0.3372793 -0.5048052 -0.0646179 -0.1537725 -0.0503802 -0.3603298 -0.0791221 0.0880018 0.017588 -0.2028665 -0.8713016 -0.0107979 0.138013 0.0415506 -0.1442871 -0.0910026 -0.0405152 0.0329268 0.0171493 0.0662439 -0.0187134 0.0189769 -0.0078054 0.0529381 0.9856955 0.439437 0.1495644 0.1022012 0.6808324 -0.0065988 0.1895573 0.0772885 0.0599571 1.2176849 0.0411836 0.1559134 0.2653439 1.4284389 0.0571377 0.1476044 -0.0125572 0.2680132 0.5216004 0.0297832 -0.031061 0.1583662 0.0852204 0.0171514 -0.0460849 -0.01964 0.0992848 -0.0538884 -0.0045176 -0.0261039 0.1017837 -0.18409 0.0189288 -0.0148149 -0.0010675 0.0688596 2.0785077 0.0162931 0.2863406 -0.3156823 1.0462156 -0.033341 0.320107 -0.0029869 0.3649695 0.0584281 -0.0190192 -0.0196809 -0.0810049 0.0075352 -0.0975287 0.0005666 -0.0391188 0.0328582 0.0209177 0.0374287 -0.0215025 0.053991 -0.0465752 0.1119751 0.0035343 0.0701571 0.0160484 0.0100444 -0.0513419 -0.0259152 -0.0117573 -0.0143554 -0.111564 -0.0046748 -0.0686288 0.0185626 -0.0330763 0.0551692 -0.0560077 0.0154831 -0.0100974 0.0889598 -0.0326344 0.0329875 0.0252294 0.1888409 0.0199628 -0.0241426 0.0510373 0.2135862 0.0052264 -0.0291292 0.0035418 0.3190015 -0.0751413 0.0485748 -0.0303424 -0.0090529 0.1178828 -0.008226 -0.0366092 0.0095375 0.1006979 0.0447609 -0.0545873 0.0897158 -0.0357719 0.0081228 0.0555314 0.0817466 0.100451 0.0093903 0.0947995 -0.0120329 -0.0540098 -0.0096758 0.0152204 -0.0512328 -0.0507435 -0.1092143 -0.0396845 0.1568767 -0.036565 -0.0320419 -0.0353265 0.213165 -0.0025701 -0.0324483 -0.0020475 0.3318979 0.0285776 0.0919813 0.020469 0.0169718 -0.0805294 -0.1311899 -0.0448447 -0.1324448 0.0844727 unknown
polarizability: 159.0043227|10.4814082|118.4419609|8.4720796|3.7036796|64.114865 unknown
InChI: InChI=1S/C7H10N2O2S/c1-4-5(2-3-12)6(10)9-7(11)8-4/h8-9,12H,2-3H2,1H3
charge 0 multiplicity 1
22 atoms
S  -4.580277 -0.033601 0.398876
O  -0.348454 -2.353229 -0.270274
O  3.69597 -0.108014 0.448877
N  1.739499 1.127581 0.078561
N  1.650554 -1.208679 0.073531
C  -0.397813 0.078192 -0.329682
C  -1.888908 0.058318 -0.604095
C  0.363398 1.225663 -0.182534
C  0.250113 -1.239614 -0.183306
C  -2.707952 -0.052694 0.703722
C  -0.150667 2.643649 -0.275357
C  2.458484 -0.074253 0.216902
H  -2.109858 -0.827189 -1.227424
H  -2.216835 0.948087 -1.168619
H  -2.533961 0.812178 1.36604
H  -2.452535 -0.974597 1.249591
H  2.301879 1.974948 0.182122
H  -1.232366 2.670627 -0.463835
H  0.352924 3.192919 -1.093481
H  0.04249 3.192833 0.665755
H  2.1194 -2.114724 0.170457
H  -4.629785 -1.249204 -0.264329
