program: Gaussian 09
title: 000269748
version: EM64L-G09RevD.01
frameworkgroup: C1[X(C14H10N2)]
method: RPBEPBE
basis: SDD
operation: Freq
keyword: #pfreq=noraman
keyword: PBEPBE/SDD
title: #p freq=noraman PBEPBE/SDD
converged: YES YES NO NO
title: Mulliken charges:
elementType: N N C C C C C C C C C C C C C C H H H H H H H H H H
charge: 0.003347 -0.022088 0.354010 0.268981 0.450469 -0.352775 -0.358286 -0.383260 -0.332714 -0.276344 -0.230926 -0.236683 -0.236875 -0.351956 -0.361694 -0.303553 0.216843 0.253330 0.225988 0.226470 0.253891 0.234622 0.231944 0.236321 0.244520 0.246418
chargesum: 0.00000
title: Mulliken charges with hydrogens summed into heavy atoms:
elementType: N N C C C C C C C C C C C C C C
charge: 0.003347 -0.022088 0.354010 0.268981 0.450469 -0.135933 -0.104956 -0.157272 -0.106244 -0.022452 0.003696 -0.004739 -0.000554 -0.107436 -0.115276 -0.303553
polarizability: 3.10502952e+02 8.55917339e+00 1.73719967e+02 1.77764852e+00 1.80822733e+00 6.62797641e+01
1716.lowfreq: -6.7392 -2.1612 0.0006 0.0007 0.0007 5.9593 28.4723 39.9005 62.1716
frequency: 28.4331 39.8981 62.1706 89.1098 143.4637 153.4820 200.2466 266.3582 297.0600 312.9545 369.6831 372.4243 400.7361 459.9185 477.2688 538.3715 573.5290 616.0907 656.7582 659.0728 670.7166 694.3197 742.2880 764.4082 776.3199 820.4762 829.9907 847.4413 877.7737 921.1218 927.1584 960.3430 969.9719 978.6231 982.3899 988.5322 993.9685 1000.3238 1034.1327 1062.3654 1093.2044 1098.3218 1177.4466 1200.8083 1215.0701 1231.1170 1264.8671 1299.1194 1324.6993 1336.8415 1366.5014 1387.1360 1408.0059 1440.1709 1465.8838 1486.2673 1535.2200 1578.1175 1582.5024 1597.7905 1612.7581 2158.7375 3115.9112 3125.5970 3129.9388 3135.3715 3140.8057 3146.2161 3150.0397 3155.3457 3170.5196 3198.4213
redmass: 3.6129 5.1685 5.7243 5.3994 8.5378 6.5894 5.9127 5.3792 4.7946 5.1984 2.5604 6.0255 2.8037 6.8663 4.3409 3.2142 7.3085 6.4435 6.5971 4.8585 6.9262 1.7724 3.0493 6.5154 1.8909 1.4790 3.7086 1.3113 1.2680 1.4234 1.5057 7.3663 1.4345 1.4203 1.4581 5.3629 4.9946 1.3543 2.0267 2.2743 1.6317 1.6900 1.0532 1.1739 1.9365 1.3463 3.9550 5.0765 1.6050 1.4623 1.6254 3.9147 2.0146 2.2822 1.9575 2.2277 6.6474 5.3128 5.3667 6.2102 6.2585 12.6345 1.0879 1.0875 1.0849 1.0874 1.0907 1.0920 1.0980 1.0964 1.1017 1.0939
irintensity: 0.0300 1.0001 2.1438 0.1486 3.6488 2.0611 0.4233 0.6593 0.8265 0.9951 0.0135 0.2372 0.0518 6.5146 4.9492 34.0996 21.5564 0.4940 1.4695 2.0887 1.2062 49.9023 5.9261 1.1535 46.5877 36.8430 12.2812 1.9536 1.8026 27.2208 0.6672 1.9712 2.0617 0.1895 0.0682 0.6080 8.4392 0.1570 2.5122 2.3042 7.2968 1.1052 0.0563 2.8823 2.7016 0.2878 28.8176 1.1527 4.7859 0.3785 6.0459 6.4171 17.7494 16.2287 4.1295 10.7035 12.4709 64.4172 5.9690 0.9109 1.2176 20.1771 13.9464 10.3009 1.7181 0.4036 26.8605 6.6801 25.2875 26.9649 28.0623 3.8884
temp: 298.150 k
press: 1.00000 atm
elementType: 7 7 6 6 6 6 6 6 6 6 6 6 6 6 6 6 1 1 1 1 1 1 1 1 1 1
symmnumber: 1
zpe: 519708.3 jmol-1
zpe.correction: 0.197946 hartree
zpe.thermalcorrener: 0.210928 hartree
zpe.thermalcorrenthalpy: 0.211872 hartree
zpe.thermalcorrgfe: 0.156604 hartree
zpe.sumelectzpe: -647.878069 hartree
zpe.sumelectthermal: -647.865088 hartree
zpe.sumelectthermalent: -647.864143 hartree
zpe.sumelectthermalfe: -647.919412 hartree
dipole: 3.6285 -3.7562 0.2582
dipole: 5.2289
quadrupole: -95.1900 -90.6831 -97.5841
quadrupole: -0.7121 0.8417 1.7686
quadrupole: -0.7043 3.8026 -3.0984 -0.7121 0.8417 1.7686
hfenergy: -648.0760158 hartree
pointgroup: C01 [X(C14H10N2)]
dipole: 1.4690728 1.4376318 0.0849585 debye
dipolederiv: -0.543806 0.0400328 0.0087846 -0.0456516 -0.279805 0.0021631 0.01044 0.000723 -0.2512802 -0.2389658 -0.0008734 0.0021041 0.1290543 -0.3228212 -0.0013326 0.0266854 -0.0118801 -0.2411471 0.0066658 0.0681171 0.0110942 -0.08424 -0.0709482 -0.0034437 0.0666351 -0.0059042 0.0064878 0.5320632 0.0840666 0.0079842 0.3526634 0.0176799 -0.0275736 -0.0402916 -0.0178861 0.0714063 0.4288307 -0.0855416 -0.0109144 -0.0322778 0.1139159 0.0015546 0.0273368 0.0066881 0.0442064 -0.0173298 -0.1486531 -0.0185204 0.1722684 0.0845938 -0.006927 -0.0028648 -0.005562 -0.1163666 -0.0553835 0.0657291 0.0225486 -0.1027345 0.0189209 0.0645169 0.0014171 0.0487869 -0.1123764 -0.0429668 -0.071887 -0.0630726 0.1101528 -0.0539522 0.0618083 -0.0325138 0.0579315 -0.1052271 -0.4097935 0.2816667 0.0114252 0.0328815 -0.0230841 0.0005292 0.0091984 -0.0046348 -0.1078927 -0.4165641 -0.1431688 0.0092178 -0.0312708 -0.1024135 -0.0032909 0.0036917 0.0054152 -0.0698949 0.0208617 -0.1146209 -0.0661538 -0.2025322 0.0057475 0.0742269 -0.1250211 0.0767361 -0.1044812 -0.1998372 0.0603289 0.0213688 0.1572157 0.085685 0.0948556 0.0853122 0.0919575 -0.10138 0.0497111 0.0432619 -0.0103356 -0.0305109 -0.0532557 0.0365391 -0.0379649 0.0361173 -0.1336846 0.3665818 -0.2955721 -0.0160979 -0.1655134 0.2692091 0.0112811 -0.0185676 0.0111517 -0.069582 0.2972651 0.2494592 -0.0045245 0.1993612 0.2276843 -0.0002138 -0.014056 -0.0014537 -0.071912 -0.0740748 0.0220821 -0.0050646 -0.2795433 0.2335167 0.0138096 -0.0397956 0.0259045 0.0443989 0.0580988 -0.0163569 0.0035556 -0.1229429 -0.0601874 0.0017742 -0.0062648 -0.0070777 0.1173377 0.1134411 -0.0551318 -0.0194057 -0.0453477 -0.0079681 -0.0639824 -0.0298951 -0.0599016 0.1278773 0.0170292 0.0928095 0.0662031 0.068592 0.0386099 -0.06177 0.0582705 -0.0500779 0.1088972 0.0484053 -0.1231682 -0.0012307 -0.0717953 -0.0401725 -0.001044 0.002483 -0.0023621 0.1503533 0.1126707 0.0525406 -0.0007514 0.0282978 0.008186 -0.0030803 0.0014836 -0.0036754 0.1455894 -0.0291788 0.0734259 0.0491011 0.1038951 0.0136534 -0.0706171 0.0618865 -0.0677246 0.1240324 0.0445932 -0.0511602 -0.0114183 -0.0918605 -0.0549861 -0.0876218 -0.0210542 -0.0917814 0.1189112 -0.1188973 -0.0496699 0.0077938 -0.0562477 0.0930508 -0.024877 0.0071836 -0.022285 0.1513741 0.0243519 0.092329 0.0041415 0.1025718 -0.0803915 -0.0065134 0.0046787 -0.0067733 0.1373648 0.0262281 -0.0700457 0.0021672 -0.0944855 -0.060468 -0.000771 0.001587 -0.0024321 0.1369882 unknown
polarizability: 309.718878|-11.5398038|171.3740158|-8.0497216|17.8130525|69.4097888 unknown
InChI: InChI=1S/C14H10N2/c15-11-14(13-4-2-1-3-5-13)10-12-6-8-16-9-7-12/h1-10H
charge 0 multiplicity 1
26 atoms
N  -4.820095 0.413878 0.142934
N  0.040561 -2.976084 -0.235346
C  1.979561 -0.039726 -0.004568
C  0.526913 -0.391665 -0.019246
C  -1.938481 0.426812 0.077357
C  -0.477085 0.557355 0.049842
C  2.944859 -0.967902 -0.486534
C  2.437609 1.215213 0.48877
C  -2.700768 1.633762 0.118969
C  -2.680468 -0.792455 0.070968
C  4.317095 -0.642922 -0.500171
C  3.808716 1.538229 0.473452
C  4.756959 0.61327 -0.025246
C  -4.108373 1.581826 0.149526
C  -4.089319 -0.743082 0.104129
C  0.232295 -1.798653 -0.135099
H  -0.135633 1.600699 0.078437
H  2.618655 -1.945019 -0.859781
H  1.730476 1.933167 0.918198
H  -2.19407 2.605949 0.126851
H  -2.187636 -1.765632 0.041065
H  5.0414 -1.370942 -0.880763
H  4.141179 2.505878 0.864704
H  5.822803 0.865274 -0.031891
H  -4.702496 2.501899 0.18065
H  -4.67266 -1.670428 0.100295
