program: Gaussian 09
title: 000277152
version: EM64L-G09RevD.01
frameworkgroup: C1[X(C12H6BrN3O7)]
method: RPBEPBE
basis: SDD
operation: Freq
keyword: #p
keyword: freq=noraman
keyword: PBEPBE/SDD
title: #p freq=noraman PBEPBE/SDD
converged: YES YES NO NO
title: Mulliken charges:
elementType: Br O O O O O O O N N N C C C C C C C C C C C C H H H H H H
charge: 0.142547 -0.245977 -0.185400 -0.162510 -0.183051 -0.165375 -0.189707 -0.193454 0.012705 0.005060 0.024793 0.238755 0.279510 -0.235817 0.591399 -0.481160 0.379548 -0.462103 -0.470786 -0.371522 0.405146 -0.153303 -0.371626 0.302476 0.334227 0.323644 0.282082 0.296633 0.253265
chargesum: 0.00000
title: Mulliken charges with hydrogens summed into heavy atoms:
elementType: Br O O O O O O O N N N C C C C C C C C C C C C
charge: 0.142547 -0.245977 -0.185400 -0.162510 -0.183051 -0.165375 -0.189707 -0.193454 0.012705 0.005060 0.024793 0.238755 0.279510 0.066659 0.591399 -0.146933 0.379548 -0.462103 -0.147142 -0.089440 0.405146 0.099961 -0.074993
polarizability: 2.85732794e+02 -4.92527341e+00 2.33683958e+02 -3.56890363e+01 -1.25164689e+01 1.32570619e+02
1716.lowfreq: -7.0692 -3.0091 -0.0006 -0.0006 -0.0004 3.6788 18.6852 19.9947 32.8795
frequency: 18.5989 19.9572 32.8749 39.3449 44.5326 46.1089 59.7561 114.9308 145.7852 151.0868 161.2908 173.7822 188.6062 216.3745 230.2761 246.5352 289.2860 319.3292 338.3498 378.8309 382.3192 425.2354 432.0399 447.3187 492.9279 514.8402 519.7707 549.5484 589.4497 608.1394 629.4494 650.9058 665.5585 677.7360 693.6115 705.6862 723.8288 730.8642 745.9673 755.9553 797.5319 816.7766 870.9170 885.9414 923.9619 930.2753 941.4430 944.4944 988.0870 1000.0504 1072.1805 1077.2336 1082.9769 1122.0612 1167.0106 1171.0209 1195.5697 1208.1220 1214.8651 1234.7647 1252.3458 1277.3728 1331.7934 1376.8521 1379.7918 1390.9074 1397.3174 1399.5591 1436.8797 1449.5090 1463.9758 1555.1551 1588.9902 1593.6952 1612.7621 3162.6633 3175.5992 3178.3059 3182.2798 3183.1309 3193.8717
redmass: 12.6294 7.8624 13.1067 15.4313 16.0431 15.4474 11.3082 10.4816 12.8453 8.2550 16.2274 6.0702 6.8543 8.3817 7.5231 13.1829 12.4308 7.7461 10.5556 9.4708 11.5561 5.0793 3.8497 4.2329 8.7768 8.7416 5.9464 6.8020 8.4621 8.1351 8.5273 7.6712 5.1420 4.1862 5.7439 5.2149 4.9706 7.5568 10.0033 11.0605 7.7448 1.4742 1.6226 5.6196 2.2176 2.0701 1.4875 1.6266 6.2579 1.3456 1.9000 2.2106 2.0140 2.5557 1.5738 2.0997 12.2454 11.8609 11.2176 3.7650 1.3761 1.3475 10.5822 9.7308 10.7717 9.4256 10.8875 9.9937 3.1895 3.0156 2.6981 10.0659 7.0488 7.6711 7.7016 1.0888 1.0920 1.0923 1.0942 1.0920 1.0981
irintensity: 1.7745 1.2177 0.3557 0.4585 0.4494 0.2146 0.1716 3.6893 2.6459 1.1711 0.6754 2.0162 3.4197 2.6359 0.7645 1.1131 1.1607 0.2886 1.6622 0.8718 1.8873 2.5255 2.4512 4.0812 6.0258 10.7322 6.0607 4.7348 4.4349 6.9300 16.7955 3.9067 2.4101 7.0356 32.5276 25.9548 4.3447 8.1762 45.0661 16.4632 10.8682 35.9910 21.3617 20.0724 34.3614 110.7100 9.3174 18.7811 4.8830 1.8966 22.0123 6.1493 43.8336 2.9920 7.3095 54.8851 345.1493 513.6715 138.2032 277.7941 38.3785 19.6872 10.6004 108.1606 82.6050 45.4260 53.0294 41.8180 12.6950 254.6333 119.5895 118.5092 151.0781 153.3453 7.4867 7.8230 2.1838 6.6463 0.4293 23.1197 3.7809
temp: 298.150 k
press: 1.00000 atm
elementType: 35 8 8 8 8 8 8 8 7 7 7 6 6 6 6 6 6 6 6 6 6 6 6 1 1 1 1 1 1
symmnumber: 1
zpe: 456882.7 jmol-1
zpe.correction: 0.174017 hartree
zpe.thermalcorrener: 0.194080 hartree
zpe.thermalcorrenthalpy: 0.195024 hartree
zpe.thermalcorrgfe: 0.120434 hartree
zpe.sumelectzpe: -1163.247000 hartree
zpe.sumelectthermal: -1163.226937 hartree
zpe.sumelectthermalent: -1163.225993 hartree
zpe.sumelectthermalfe: -1163.300583 hartree
dipole: 4.4758 -0.1352 -5.0930
dipole: 6.7816
quadrupole: -157.4937 -163.3026 -139.2105
quadrupole: 11.1205 -12.5843 2.9139
quadrupole: -4.1581 -9.9670 14.1251 11.1205 -12.5843 2.9139
hfenergy: -1163.4210172 hartree
pointgroup: C01 [X(C12H6Br1N3O7)]
dipole: -1.790635 0.1283526 -1.9737725 debye
polarizability: 286.6761698|-6.2549526|233.0289342|33.3080073|15.0705325|132.2822671 unknown
InChI: InChI=1S/C12H6BrN3O7/c13-9-5-12(11(16(21)22)6-10(9)15(19)20)23-8-3-1-2-7(4-8)14(17)18/h1-6H
charge 0 multiplicity 1
29 atoms
Br 2.163542 3.169136 -0.840391
O  -0.679796 -1.311091 -0.682935
O  2.378396 -3.500033 0.990214
O  0.672867 -3.624602 -0.523974
O  5.433263 0.157003 0.150916
O  4.572218 2.191031 0.731214
O  -5.087636 2.398786 1.263441
O  -3.034768 2.147559 2.227957
N  1.547316 -2.969545 0.154222
N  4.452519 0.982226 0.310086
N  -3.908155 1.883004 1.316295
C  0.545706 -0.698088 -0.458522
C  1.649293 -1.503107 -0.046578
C  0.755526 0.687329 -0.659282
C  3.090569 0.468571 0.009975
C  2.900874 -0.914383 0.18802
C  -1.899224 -0.5738 -0.709543
C  2.011253 1.281723 -0.432519
C  -2.243753 0.331213 0.312453
C  -2.79803 -0.910459 -1.744143
C  -3.524852 0.916653 0.247941
C  -4.074599 -0.30737 -1.768439
C  -4.451624 0.619828 -0.773335
H  -0.070286 1.307942 -1.015262
H  3.738153 -1.536185 0.516654
H  -1.57687 0.575165 1.143986
H  -2.491579 -1.640277 -2.498471
H  -5.431702 1.102719 -0.769761
H  -4.777118 -0.563244 -2.566918
