program: Gaussian 09
title: 000269742
version: EM64L-G09RevD.01
frameworkgroup: C1[X(C20H16N4O5)]
method: RPBEPBE
basis: SDD
operation: Freq
keyword: #p
keyword: freq=noraman
keyword: PBEPBE/SDD
title: #p freq=noraman PBEPBE/SDD
converged: YES YES NO NO
title: Mulliken charges:
elementType: O O O O O N N N N C C C C C C C C C C C C C C C C C C C C H H H H H H H H H H H H H H H H
charge: -0.245855 -0.190518 -0.270668 -0.214080 -0.208450 -0.414350 -0.016322 0.023787 0.015053 -0.469683 0.479158 0.308849 0.349741 0.263145 0.459370 -0.291121 -0.499414 0.446545 -0.341206 -0.357032 -0.384387 -0.344494 -0.369291 -0.386554 -0.386677 -0.380367 -0.225324 -0.225311 -0.227987 0.219300 0.219395 0.291970 0.335700 0.257144 0.259681 0.228241 0.263802 0.292150 0.234721 0.234732 0.348506 0.221066 0.231569 0.231564 0.233903
chargesum: 0.00000
title: Mulliken charges with hydrogens summed into heavy atoms:
elementType: O O O O O N N N N C C C C C C C C C C C C C C C C C C C C
charge: -0.245855 -0.190518 -0.270668 -0.214080 -0.208450 -0.065844 -0.016322 0.023787 0.015053 -0.030988 0.479158 0.308849 0.349741 0.263145 0.459370 0.000849 -0.163714 0.446545 -0.084063 -0.097351 -0.156146 -0.080692 -0.077142 -0.151833 -0.151945 -0.159302 0.006245 0.006253 0.005916
polarizability: 7.45685009e+02 1.39697668e+01 2.88194008e+02 1.74887686e-01 -5.19661732e-02 1.43832153e+02
1716.lowfreq: -11.9133 -0.0007 0.0010 0.0014 1.9268 3.4147 5.5557 16.4135 21.5463
frequency: -11.6218 16.2057 21.5359 29.3274 39.8052 54.9611 56.7478 68.9861 75.1644 108.9467 112.0806 121.7199 148.9470 162.8097 163.3943 216.0008 216.2828 249.5436 271.0842 303.4489 323.1042 342.7123 346.4687 363.5453 390.3651 392.4610 402.7231 423.3888 427.9747 445.7507 463.8391 504.3217 511.9148 513.5423 530.1445 556.4973 609.2566 617.5474 625.3664 636.7056 649.4468 667.9359 672.0378 701.8510 704.6884 722.1655 735.7423 743.6012 753.4861 780.5672 809.8196 812.8558 837.4318 845.8155 849.9968 853.2066 860.5327 872.7194 902.7292 913.4460 933.1754 936.6434 961.3759 963.5024 976.5998 977.4882 987.4142 991.1364 998.6025 999.3313 1009.1776 1027.3264 1039.9722 1061.9248 1090.6145 1099.7883 1121.0498 1137.4380 1164.6493 1174.4815 1174.7825 1188.6734 1196.5210 1210.4290 1223.7069 1230.0570 1230.5236 1253.9549 1298.7677 1301.9008 1321.9295 1327.8034 1343.9302 1355.3899 1362.3474 1380.1757 1388.1405 1404.4587 1438.5255 1442.0409 1450.5169 1477.9491 1479.0331 1487.5951 1497.5801 1516.7188 1549.7751 1572.4183 1589.5636 1598.0162 1617.7290 1619.6467 1623.6170 2970.8621 2994.7985 3034.6387 3123.8805 3124.8536 3124.8938 3137.8539 3151.1855 3154.7590 3167.1372 3169.1155 3175.9792 3180.2677 3188.5247 3191.6335 3201.3004
redmass: 3.8288 7.1202 7.8859 4.5031 5.6879 6.2805 10.7588 6.4919 11.0970 4.9975 7.5287 7.4998 7.1101 10.8766 5.8414 5.8502 3.9711 6.0859 5.5309 8.6728 5.0665 2.3834 8.3899 10.8232 6.4760 4.4654 2.8017 3.1753 5.6112 4.3656 7.6076 4.9169 5.2274 3.6762 2.4446 6.2314 6.3426 6.3401 6.4959 6.9267 7.9073 6.3303 9.9140 1.8500 7.8515 4.9973 3.6760 2.3301 10.7715 3.6595 5.7693 1.3264 1.1755 3.5837 1.5033 1.2509 1.3873 5.9649 5.2838 3.3372 1.3908 2.0648 1.5214 1.4074 1.5666 1.3949 1.3482 6.0851 2.6818 1.3365 1.3163 2.1809 3.1869 2.8986 1.5078 4.1633 1.3107 1.3404 6.9541 1.0538 1.3806 1.1136 1.0866 4.1669 2.3088 2.4330 2.0319 2.2493 2.0631 1.4834 2.0574 1.2685 4.4496 1.5281 6.2637 3.7749 8.4216 3.0878 4.3195 2.1886 5.6687 1.1860 2.8831 2.4285 2.5041 3.9435 6.7274 5.9568 4.4453 6.1249 6.1968 6.2490 7.1982 1.0559 1.0876 1.1079 1.0859 1.0898 1.0887 1.0917 1.0962 1.0879 1.1016 1.0937 1.0975 1.0894 1.0913 1.0802 1.0962
irintensity: 0.0016 0.4963 0.3535 0.0069 2.3433 0.4812 0.0388 1.0146 0.5608 0.2354 0.7092 0.5606 2.0843 0.6937 6.2303 9.3888 2.7417 0.5909 10.0534 3.2376 6.6889 0.4648 7.1544 5.2224 7.0327 0.0898 0.0005 0.1521 24.7945 1.2751 1.8709 4.9845 20.4034 16.3872 16.0649 2.2111 18.0410 0.1040 6.0605 46.2150 15.6723 0.8711 17.4243 43.7174 7.5599 2.0670 0.4012 71.7762 1.5756 12.9157 0.2628 26.6848 115.8096 39.4366 12.4841 0.1684 24.4299 4.3107 4.5652 295.4240 15.7887 53.5894 23.0449 31.7515 0.7095 0.0014 0.5236 2.3794 6.9870 0.0984 0.0309 6.3415 4.3715 83.9934 7.0802 64.2868 33.7298 57.7793 446.3833 0.0092 577.3232 2.4424 1.4248 796.0430 325.3153 47.9952 131.4247 138.1357 102.0553 29.0987 171.3188 0.2556 233.3479 16.9290 62.2898 5.1408 0.7233 24.5681 69.4583 9.6126 2.7917 24.2606 86.3515 1.6329 236.9649 4.7586 115.9900 58.0555 140.0402 0.7441 2.0474 776.2322 258.6310 46.8275 30.5027 21.9504 8.2925 11.3039 3.0140 13.2810 35.1522 2.0096 28.5601 23.6960 7.9609 3.8293 17.3280 67.9386 0.1503
temp: 298.150 k
press: 1.00000 atm
elementType: 8 8 8 8 8 7 7 7 7 6 6 6 6 6 6 6 6 6 6 6 6 6 6 6 6 6 6 6 6 1 1 1 1 1 1 1 1 1 1 1 1 1 1 1 1
symmnumber: 1
zpe: 864016.6 jmol-1
zpe.correction: 0.329087 hartree
zpe.thermalcorrener: 0.352950 hartree
zpe.thermalcorrenthalpy: 0.353894 hartree
zpe.thermalcorrgfe: 0.272098 hartree
zpe.sumelectzpe: -1364.628544 hartree
zpe.sumelectthermal: -1364.604680 hartree
zpe.sumelectthermalent: -1364.603736 hartree
zpe.sumelectthermalfe: -1364.685532 hartree
dipole: -12.6833 -1.8675 -0.0109
dipole: 12.8201
quadrupole: -209.8240 -179.1699 -162.6756
quadrupole: -4.2416 -0.0457 0.0296
quadrupole: -25.9341 4.7199 21.2142 -4.2416 -0.0457 0.0296
hfenergy: -1364.9576301 hartree
pointgroup: C01 [X(C20H16N4O5)]
dipole: 4.9907339 0.7298312 -0.0001885 debye
polarizability: 745.7119058|13.5208629|288.1551574|-0.3251694|1.2991171|143.8441069 unknown
InChI: InChI=1S/C20H16N4O5/c25-23(26)17-8-11-19(20(12-17)24(27)28)22-21-13-15-6-9-18(10-7-15)29-14-16-4-2-1-3-5-16/h1-13,22H,14H2
charge 0 multiplicity 1
45 atoms
O  4.874503 -0.234305 -0.004919
O  -6.770742 2.678549 0.032323
O  -4.527983 3.081986 0.032761
O  -7.178011 -3.585671 -0.027911
O  -8.57075 -1.772586 -0.008266
N  -2.840726 1.098014 0.010404
N  -1.565483 0.551916 0.003959
N  -5.554559 2.255914 0.026156
N  -7.394022 -2.308587 -0.015492
C  5.986225 0.764018 0.001071
C  7.290341 0.005832 -0.00271
C  -3.947598 0.281565 0.004369
C  3.567664 0.251759 -0.001101
C  -5.290805 0.819467 0.011677
C  0.824557 1.000055 0.005635
C  -3.803302 -1.146214 -0.009674
C  -6.416339 -0.033171 0.005117
C  -6.221412 -1.418448 -0.008653
C  3.211941 1.626747 0.008461
C  2.552269 -0.747747 -0.007298
C  1.850032 1.984796 0.011761
C  1.204058 -0.378828 -0.004041
C  -4.91334 -1.984036 -0.016132
C  7.908056 -0.364924 1.217824
C  7.910075 -0.349693 -1.226745
C  -0.569407 1.424413 0.009814
C  9.125024 -1.081847 1.216272
C  9.127081 -1.066554 -1.232042
C  9.737099 -1.433128 -0.009615
H  5.886246 1.393119 0.907539
H  5.886951 1.403451 -0.898212
H  -2.787959 -1.546018 -0.015115
H  -7.423088 0.392117 0.010801
H  3.974062 2.410635 0.013435
H  2.859358 -1.797805 -0.01454
H  1.577165 3.047457 0.019296
H  0.419933 -1.141901 -0.008671
H  -4.807901 -3.071928 -0.026882
H  7.432509 -0.096195 2.168895
H  7.436112 -0.069154 -2.175189
H  -3.040327 2.122205 0.020122
H  -0.757295 2.516106 0.01903
H  9.595151 -1.363818 2.164643
H  9.598834 -1.336654 -2.183061
H  10.682596 -1.986808 -0.012299
