program: Gaussian 09
title: 000269737
version: EM64L-G09RevD.01
frameworkgroup: C1[X(C20H13N3)]
method: RPBEPBE
basis: SDD
operation: Freq
keyword: #pfreq=noraman
keyword: PBEPBE/SDD
title: #p freq=noraman PBEPBE/SDD
converged: YES YES NO NO
title: Mulliken charges:
elementType: N N N C C C C C C C C C C C C C C C C C C C C H H H H H H H H H H H H H
charge: -0.003828 0.009421 -0.000084 0.358552 -0.358901 0.165514 0.421796 0.250925 -0.381373 -0.377184 -0.461279 -0.247500 -0.428325 0.053048 -0.455081 0.061941 -0.268923 -0.241399 -0.188939 -0.340291 -0.311254 -0.212655 -0.217184 0.252958 0.265026 0.211019 0.243100 0.232767 0.241349 0.252252 0.231621 0.233427 0.269722 0.263034 0.238608 0.238119
chargesum: 0.00000
title: Mulliken charges with hydrogens summed into heavy atoms:
elementType: N N N C C C C C C C C C C C C C C C C C C C C
charge: -0.003828 0.009421 -0.000084 0.358552 -0.105943 0.165514 0.421796 0.250925 -0.116348 -0.166164 -0.218179 -0.014733 -0.186976 0.053048 -0.202829 0.061941 -0.037302 -0.007972 -0.188939 -0.070568 -0.048220 0.025953 0.020935
polarizability: 3.24971497e+02 3.56693736e+01 2.16977732e+02 2.18254469e+01 2.33124740e+01 1.76314223e+02
1716.lowfreq: -2.7334 -0.0008 -0.0005 0.0004 1.4278 11.0760 12.9492 22.5469 35.7178
frequency: 12.3175 21.6925 35.6210 79.2764 93.2933 125.9566 133.2541 170.7763 173.5398 176.6728 241.2254 282.1167 306.0339 376.2554 403.8266 407.6350 411.6435 429.9540 438.7047 470.8805 491.0831 503.1741 514.5699 522.5084 528.0342 554.2720 572.7400 603.4123 632.9155 648.5290 677.9095 727.7333 744.3691 755.1358 775.3353 781.8453 787.1340 793.0482 808.8174 816.2215 847.7669 876.6567 890.9693 896.4695 918.3563 931.0337 953.8330 961.4515 976.4691 980.2472 988.9777 996.2831 1002.5406 1010.6933 1024.4036 1034.6244 1083.4475 1111.6576 1146.2656 1152.9941 1175.7544 1177.7520 1183.6362 1200.1122 1219.6914 1237.9211 1245.1179 1255.1184 1273.2913 1278.9980 1300.0185 1341.0693 1376.2909 1380.9146 1405.0569 1414.4581 1416.1175 1442.5734 1456.4230 1457.4349 1476.8560 1519.7771 1528.1039 1550.5960 1587.1123 1599.6826 1616.7195 1633.5272 2204.7983 3032.6304 3123.2660 3124.6203 3127.6627 3130.9887 3138.1850 3139.2615 3147.3991 3152.0817 3162.4027 3165.8975 3166.9195 3176.0015
redmass: 5.5565 5.6284 5.3404 5.9230 9.1515 6.4277 4.8216 5.9358 4.3464 4.0940 4.4381 6.4403 6.0642 6.4233 5.7821 4.3283 4.5178 4.2753 4.7069 3.2601 4.2449 6.0174 4.8518 7.3466 5.2977 5.6835 4.1624 8.8676 5.5030 3.8866 3.7889 3.9548 1.4748 3.8662 2.1441 2.2250 4.6365 2.2067 2.5151 1.6163 4.3310 1.9538 1.7509 4.9247 1.5357 1.4590 5.1976 1.5036 1.3633 4.1445 1.3761 1.3895 1.3317 2.0728 4.1415 2.2296 2.2677 1.7678 1.5725 1.4482 1.1677 1.3733 1.2244 1.9377 1.7807 1.9769 2.0521 1.9177 1.6518 2.5931 2.0444 2.2187 2.3334 2.0101 3.1968 4.9153 3.8126 2.4467 2.4347 2.7856 3.4685 3.8123 7.2203 6.8717 7.5181 5.2557 6.4684 6.5233 12.5976 1.0808 1.0914 1.0864 1.0870 1.0875 1.0863 1.0918 1.0945 1.0898 1.0992 1.1004 1.0958 1.1005
irintensity: 0.0653 0.5874 0.2689 0.2126 1.8502 3.4436 0.5251 0.6439 4.9034 2.3805 3.9999 0.2590 0.9658 0.8882 2.4903 5.1143 13.3168 4.2562 3.9697 0.8918 2.1614 2.0080 2.3174 0.2197 0.7818 3.2355 2.6473 2.3950 5.2062 1.3476 0.4850 1.8989 4.0183 3.3743 49.8985 39.0013 3.8454 89.6027 35.9903 25.8251 3.0797 11.5926 0.4632 3.0483 12.0007 0.1834 7.3206 2.8480 4.5856 5.4347 0.3964 1.3809 0.0089 11.0636 6.5191 6.0370 5.4950 6.7709 18.1154 2.0786 0.7649 3.0288 3.7547 2.1792 23.6050 7.4168 3.4696 1.1219 20.2438 8.4861 3.1970 3.8408 23.7782 17.6578 3.3824 0.6616 5.4027 7.7894 1.7397 1.3210 31.8893 12.3583 36.5573 7.4131 0.1751 4.9804 1.0615 0.4509 8.5913 4.7985 21.7171 2.7021 3.2955 1.5292 2.8531 9.7875 42.5766 7.2417 23.3287 21.9111 9.9781 24.0283
temp: 298.150 k
press: 1.00000 atm
elementType: 7 7 7 6 6 6 6 6 6 6 6 6 6 6 6 6 6 6 6 6 6 6 6 1 1 1 1 1 1 1 1 1 1 1 1 1
symmnumber: 1
zpe: 715108.7 jmol-1
zpe.correction: 0.272371 hartree
zpe.thermalcorrener: 0.289804 hartree
zpe.thermalcorrenthalpy: 0.290748 hartree
zpe.thermalcorrgfe: 0.224594 hartree
zpe.sumelectzpe: -932.636315 hartree
zpe.sumelectthermal: -932.618882 hartree
zpe.sumelectthermalent: -932.617938 hartree
zpe.sumelectthermalfe: -932.684092 hartree
dipole: -0.1016 -3.4168 2.5229
dipole: 4.2485
quadrupole: -103.5379 -146.5765 -128.2162
quadrupole: 5.7019 3.9205 14.5311
quadrupole: 22.5723 -20.4663 -2.1060 5.7019 3.9205 14.5311
hfenergy: -932.9086858 hartree
pointgroup: C01 [X(C20H13N3)]
dipole: -0.0314211 1.5351492 0.6604784 debye
polarizability: 315.7191874|36.1517864|209.5002006|-35.5207319|-34.5287464|193.0440634 unknown
InChI: InChI=1S/C20H13N3/c21-12-17(16-9-5-7-14-6-1-2-8-15(14)16)20-13-22-18-10-3-4-11-19(18)23-20/h1-11,13,17H
charge 0 multiplicity 1
36 atoms
N  -1.813049 -1.041279 0.006168
N  -2.262128 1.676736 -0.824338
N  0.189637 -3.680208 -1.286697
C  1.494655 -0.66119 0.019597
C  0.431838 -1.033619 -1.04161
C  2.552961 0.279758 -0.266969
C  3.48444 0.610216 0.800235
C  -0.905197 -0.353724 -0.707509
C  1.381994 -1.229845 1.294032
C  2.746462 0.912227 -1.543545
C  3.335886 0.002314 2.088961
C  2.303424 -0.903688 2.332026
C  4.545285 1.542472 0.548178
C  -2.992995 -0.382694 0.330836
C  -1.13483 1.008468 -1.120935
C  -3.220735 0.987467 -0.086224
C  3.790124 1.815106 -1.758278
C  4.699505 2.138047 -0.703459
C  0.279961 -2.498295 -1.161845
C  -3.996403 -1.065951 1.082713
C  -4.443365 1.637758 0.261979
C  -5.184808 -0.406868 1.410783
C  -5.409055 0.94793 1.000582
H  0.75646 -0.672169 -2.033633
H  0.56956 -1.937904 1.492977
H  2.077679 0.684494 -2.380563
H  4.048651 0.261676 2.880528
H  2.192517 -1.368807 3.31693
H  5.238493 1.779171 1.364142
H  -0.374695 1.55081 -1.69557
H  3.916313 2.278513 -2.742752
H  5.513251 2.848172 -0.884512
H  -3.803014 -2.10093 1.380484
H  -4.588873 2.671655 -0.065677
H  -5.956994 -0.928253 1.986512
H  -6.348559 1.442138 1.270054
