program: Gaussian 09
title: 000277154
version: EM64L-G09RevD.01
frameworkgroup: C1[X(C12H4BrCl3N2O5)]
method: RPBEPBE
basis: SDD
operation: Freq
keyword: #p
keyword: freq=noraman
keyword: PBEPBE/SDD
title: #p freq=noraman PBEPBE/SDD
converged: YES YES NO NO
title: Mulliken charges:
elementType: Br Cl Cl Cl O O O O O N N C C C C C C C C C C C C H H H H
charge: 0.136940 0.027818 0.029620 0.033157 -0.232981 -0.186310 -0.161972 -0.167600 -0.184030 0.013297 0.005089 0.235777 0.293021 -0.209952 -0.481079 0.590340 0.481073 -0.466772 -0.319272 -0.314643 -0.066713 -0.173234 -0.106074 0.297363 0.334495 0.300949 0.291693
chargesum: 0.00000
title: Mulliken charges with hydrogens summed into heavy atoms:
elementType: Br Cl Cl Cl O O O O O N N C C C C C C C C C C C C
charge: 0.136940 0.027818 0.029620 0.033157 -0.232981 -0.186310 -0.161972 -0.167600 -0.184030 0.013297 0.005089 0.235777 0.293021 0.087412 -0.146584 0.590340 0.481073 -0.466772 -0.319272 -0.013694 -0.066713 0.118459 -0.106074
polarizability: 3.12332082e+02 -2.06261675e+01 2.22631716e+02 -2.10378489e+01 -9.08526859e+00 1.51766946e+02
1716.lowfreq: -7.7146 -4.5286 -0.0014 0.0006 0.0009 4.0237 14.4400 15.7136 29.1531
frequency: 14.4046 15.5539 29.1471 36.4754 41.4596 44.0674 66.4443 112.8311 127.8859 134.3441 160.1046 171.8507 178.2309 190.3766 201.6849 218.0882 240.0011 250.9103 296.5222 310.6549 319.6210 338.0089 367.0507 414.2847 416.4507 443.9536 457.0979 492.0522 513.6963 545.7714 581.8127 591.6749 596.9240 637.2967 651.1667 664.5108 675.8905 690.4111 723.0902 727.3643 732.7907 754.2811 787.2738 856.3182 868.4349 880.3970 881.5955 924.1058 943.6854 1034.2544 1078.0820 1105.0449 1120.9152 1186.3918 1196.4125 1210.3244 1226.6569 1233.1423 1250.1745 1324.3638 1333.8633 1358.3063 1378.2448 1397.4153 1399.6041 1435.0783 1450.1082 1556.9244 1558.2813 1575.9056 1598.2886 3173.5832 3181.6477 3183.3885 3183.7153
redmass: 21.6548 16.1208 19.4970 16.4430 17.5066 17.4536 30.3542 11.1363 17.0401 12.0564 18.7814 12.4016 21.6622 6.4273 10.4914 8.1998 20.5789 14.9740 13.9196 19.8253 13.8479 11.3367 13.3628 8.1178 10.7318 3.5314 3.8893 8.1851 9.2440 7.8806 8.1237 10.3633 8.9404 8.6329 7.7246 6.7635 6.9210 4.8197 4.6130 8.2495 7.2870 12.5606 8.2109 1.4685 1.6110 6.5844 1.4573 6.3696 1.6046 7.0269 3.7752 1.7525 2.5629 5.6530 11.7351 12.3844 1.3020 3.0949 1.4177 9.3335 10.8765 10.3419 10.2817 12.2624 11.8764 3.0721 3.1642 10.0426 10.6082 7.9579 8.0920 1.0915 1.0929 1.0919 1.0937
irintensity: 0.1434 0.5618 0.0612 0.3469 0.3581 0.2137 0.0323 4.1775 0.5783 0.5195 1.8114 0.7609 0.4485 1.6311 0.5607 0.2130 0.8133 0.5508 0.5277 0.3204 1.0556 1.4477 1.2644 5.1358 0.0821 5.0510 17.4687 5.5707 4.4580 13.1238 7.3939 2.9053 24.1534 29.8174 15.4404 1.8742 9.0960 4.9737 4.6544 22.9612 9.1750 24.7796 7.1523 3.9656 15.6176 10.1855 28.0468 133.1078 21.8147 109.0426 32.0295 98.9018 2.7425 9.8139 344.3828 383.3114 18.1880 156.3362 41.3463 54.6196 13.1236 12.5653 102.7754 61.6719 61.1998 369.1623 110.3284 93.3695 2.1430 63.5191 231.9077 0.9600 5.2922 24.4573 0.7891
temp: 298.150 k
press: 1.00000 atm
elementType: 35 17 17 17 8 8 8 8 8 7 7 6 6 6 6 6 6 6 6 6 6 6 6 1 1 1 1
symmnumber: 1
zpe: 377111.8 jmol-1
zpe.correction: 0.143634 hartree
zpe.thermalcorrener: 0.165009 hartree
zpe.thermalcorrenthalpy: 0.165953 hartree
zpe.thermalcorrgfe: 0.087639 hartree
zpe.sumelectzpe: -2337.102752 hartree
zpe.sumelectthermal: -2337.081377 hartree
zpe.sumelectthermalent: -2337.080433 hartree
zpe.sumelectthermalfe: -2337.158747 hartree
dipole: 4.8409 -2.9301 0.2405
dipole: 5.6637
quadrupole: -188.0164 -180.0975 -155.3740
quadrupole: -0.3985 3.7031 0.9758
quadrupole: -13.5204 -5.6015 19.1220 -0.3985 3.7031 0.9758
hfenergy: -2337.2463861 hartree
pointgroup: C01[X(C12H4Br1Cl3N2O5)]
dipole: -1.8681758 1.1911715 -0.2372858 debye
polarizability: 304.7339633|-19.7539189|224.4632657|40.0144048|-1.4943601|157.5335154 unknown
InChI: InChI=1S/C12H4BrCl3N2O5/c13-5-1-12(10(18(21)22)4-9(5)17(19)20)23-11-3-7(15)6(14)2-8(11)16/h1-4H
charge 0 multiplicity 1
27 atoms
Br 2.091139 3.301733 -0.29234
Cl -1.524984 0.062923 2.654847
Cl -4.775929 0.540811 -2.866696
Cl -5.9426 1.912943 -0.113714
O  -0.759513 -1.168751 -0.079812
O  2.495395 -3.512183 0.857464
O  0.55866 -3.489329 -0.35249
O  4.704359 2.187759 0.76443
O  5.436018 0.200355 -0.087764
N  1.546078 -2.903151 0.226278
N  4.502836 1.01506 0.2776
C  0.502211 -0.584031 -0.027207
C  1.64058 -1.425177 0.142988
C  0.696543 0.812013 -0.132475
C  2.921372 -0.860888 0.23371
C  3.103198 0.532472 0.148556
C  -1.924401 -0.356054 -0.085024
C  1.980551 1.382602 -0.047508
C  -2.431739 0.221688 1.101859
C  -2.6488 -0.259306 -1.288075
C  -3.875487 0.433127 -1.310439
C  -3.656348 0.913879 1.081738
C  -4.376929 1.021703 -0.126711
H  -0.168396 1.462498 -0.28522
H  3.789224 -1.511116 0.374139
H  -2.257142 -0.737927 -2.189137
H  -4.052493 1.360448 1.997103
