program: Gaussian 09
title: 000277116
version: EM64L-G09RevD.01
frameworkgroup: C1[X(C12H9N5O4)]
method: RPBEPBE
basis: SDD
operation: Freq
keyword: #p
keyword: freq=noraman
keyword: PBEPBE/SDD
title: #p freq=noraman PBEPBE/SDD
converged: NO YES NO NO
title: Mulliken charges:
elementType: O O O O N N N N N C C C C C C C C C C C C H H H H H H H H H
charge: -0.197064 -0.205682 -0.201103 -0.203601 -0.407657 -0.163471 0.020464 -0.000801 0.022448 0.524098 -0.548085 0.428779 -0.376504 0.203581 -0.385946 0.398303 -0.147487 -0.412895 -0.348910 -0.364743 -0.164387 0.286525 0.280341 0.291404 0.246016 0.309043 0.261110 0.290210 0.321563 0.244452
chargesum: 0.00000
title: Mulliken charges with hydrogens summed into heavy atoms:
elementType: O O O O N N N N N C C C C C C C C C C C C
charge: -0.197064 -0.205682 -0.201103 -0.203601 -0.086095 -0.163471 0.020464 -0.000801 0.022448 0.524098 -0.261560 0.428779 -0.096163 0.203581 -0.094542 0.398303 0.098529 -0.103853 -0.087800 -0.074533 0.080066
polarizability: 4.23354267e+02 2.48438677e+01 2.13110879e+02 -5.31789595e-01 4.04546532e-01 6.70558504e+01
1716.lowfreq: -6.4937 -0.0009 -0.0005 0.0004 0.7593 5.2207 14.5543 29.6841 33.0106
frequency: 14.3574 29.6721 33.0071 51.0959 61.9305 105.2233 121.8436 163.0858 169.6143 187.4266 209.4593 244.5817 247.6013 267.5592 316.4105 357.7309 380.8341 411.3019 425.8797 429.6005 477.1877 508.0665 532.3844 533.4180 544.9083 631.8106 637.3634 660.5940 681.2911 683.2743 684.1241 702.4965 708.1435 725.5256 755.4370 794.7117 816.7225 820.6891 893.3489 912.5473 938.5881 943.6732 950.1222 959.6548 984.4620 985.5197 1000.5677 1001.0952 1070.5247 1079.6221 1079.8212 1089.5737 1162.3725 1167.6337 1174.5400 1198.8341 1217.0943 1221.5095 1254.8807 1280.2752 1305.2248 1353.6418 1378.0499 1378.9582 1392.6530 1397.3846 1437.5378 1442.1951 1464.5936 1477.3348 1509.7657 1576.8141 1592.4197 1609.6763 1622.1341 3154.0396 3157.9410 3163.0609 3173.5529 3188.4333 3191.1313 3192.8323 3196.4194 3392.7267
redmass: 7.0133 7.8223 9.2412 13.5948 9.0418 10.0539 5.5002 5.4414 5.5509 8.9959 4.4462 4.7934 7.4844 6.9637 5.4082 8.9378 8.9584 7.8824 3.2931 3.4814 7.9133 7.8542 6.3596 5.1415 5.3949 6.7553 6.9498 8.1607 2.3737 9.5100 2.1092 4.1733 6.6770 1.4051 10.7550 9.2507 1.4217 1.4536 5.4075 1.5829 1.3997 1.4725 1.4232 3.6412 6.1619 6.2459 1.3526 1.3484 1.8621 1.8670 1.5791 1.5424 2.7687 1.2620 1.2407 4.2141 8.9965 9.0021 1.9513 1.4537 1.5235 6.0659 11.2768 10.9889 6.4155 6.1809 3.6149 3.3805 2.7430 2.3042 2.5086 6.5263 6.0033 7.4536 7.0917 1.0880 1.0893 1.0922 1.0946 1.0929 1.0935 1.0948 1.0975 1.0750
irintensity: 3.2847 0.0391 1.3478 0.0048 0.1809 2.7340 0.6213 0.3122 2.3086 2.3741 9.5528 0.1305 5.9206 5.4764 2.1648 6.5863 0.2769 7.2819 1.4631 0.0775 0.0625 5.6830 6.1473 8.3630 1.6617 24.6898 2.9794 36.2240 14.4586 17.4273 19.1554 0.8237 34.5750 114.9317 45.8070 3.9024 31.4892 38.0599 4.2132 39.5111 11.0863 5.8414 13.7164 2.2058 0.9516 0.2819 1.8052 2.3292 27.4006 0.7417 37.7906 15.9666 239.9211 18.8720 59.0667 109.8669 43.8803 355.5081 305.2596 45.2761 64.9119 177.9134 96.7174 111.4488 55.2478 82.9498 13.2545 13.4297 131.6537 35.7469 320.8231 2.4166 4.5997 5.0734 120.9778 10.3085 8.9717 9.1028 8.7508 1.5271 0.8106 6.2424 5.8437 14.5088
temp: 298.150 k
press: 1.00000 atm
elementType: 8 8 8 8 7 7 7 7 7 6 6 6 6 6 6 6 6 6 6 6 6 1 1 1 1 1 1 1 1 1
symmnumber: 1
zpe: 540958.2 jmol-1
zpe.correction: 0.206040 hartree
zpe.thermalcorrener: 0.223584 hartree
zpe.thermalcorrenthalpy: 0.224528 hartree
zpe.thermalcorrgfe: 0.157201 hartree
zpe.sumelectzpe: -1035.643395 hartree
zpe.sumelectthermal: -1035.625851 hartree
zpe.sumelectthermalent: -1035.624906 hartree
zpe.sumelectthermalfe: -1035.692234 hartree
dipole: -1.8644 -2.9043 0.0867
dipole: 3.4523
quadrupole: -166.2662 -116.2619 -121.4063
quadrupole: 30.4479 -0.0109 0.1249
quadrupole: -31.6214 18.3829 13.2385 30.4479 -0.0109 0.1249
hfenergy: -1035.8494348 hartree
pointgroup: C01 [X(C12H9N5O4)]
dipole: -0.73645 1.0845061 0.3554018 debye
polarizability: 422.8683486|-28.0334618|193.9070034|5.998454|48.9428849|86.7456446 unknown
InChI: InChI=1S/C12H9N5O4/c18-16(19)11-5-1-3-9(7-11)13-15-14-10-4-2-6-12(8-10)17(20)21/h1-8,13H
charge 0 multiplicity 1
30 atoms
O  6.942029 -0.569217 -0.130606
O  6.104135 1.40351 0.646394
O  -6.025017 -1.590213 -1.118259
O  -3.883254 -2.349102 -1.295752
N  1.120675 1.015125 0.229093
N  -1.003175 1.602537 0.356448
N  5.962463 0.2207 0.148537
N  -0.172741 0.646267 0.01375
N  -4.749586 -1.441837 -0.99458
C  2.190837 0.149169 -0.072402
C  3.508281 0.600479 0.181279
C  4.579951 -0.261229 -0.120531
C  1.972102 -1.146703 -0.618157
C  -2.380968 1.275523 0.159478
C  4.396535 -1.550494 -0.662323
C  -4.246724 -0.138573 -0.474155
C  3.072522 -1.977421 -0.905351
C  -2.859525 0.033433 -0.337054
C  -3.304857 2.299425 0.50165
C  -5.184298 0.866364 -0.140914
C  -4.692598 2.093223 0.350839
H  3.719828 1.589164 0.600739
H  0.950086 -1.481787 -0.808803
H  5.263589 -2.178527 -0.878309
H  2.894989 -2.972381 -1.325271
H  -2.174149 -0.773019 -0.607172
H  -2.909199 3.246041 0.88268
H  -6.252212 0.673915 -0.268751
H  1.292895 1.955108 0.61939
H  -5.392812 2.890619 0.617813
