program: Gaussian 09
title: 000277118
version: EM64L-G09RevD.01
frameworkgroup: C1[X(C14H9N5)]
method: RPBEPBE
basis: SDD
operation: Freq
keyword: #pfreq=noraman
keyword: PBEPBE/SDD
title: #p freq=noraman PBEPBE/SDD
converged: YES YES NO NO
title: Mulliken charges:
elementType: N N N N N C C C C C C C C C C C C C C H H H H H H H H H
charge: -0.395568 -0.158690 -0.010467 -0.018907 -0.016728 0.486189 -0.396851 -0.347370 0.177318 0.400271 -0.345262 -0.346486 -0.331474 -0.277332 0.397250 -0.351253 -0.350070 -0.253970 -0.250767 0.235915 0.272514 0.260663 0.260699 0.258577 0.265842 0.316106 0.261242 0.258610
chargesum: 0.00000
title: Mulliken charges with hydrogens summed into heavy atoms:
elementType: N N N N N C C C C C C C C C C C C C C
charge: -0.079462 -0.158690 -0.010467 -0.018907 -0.016728 0.486189 -0.160936 -0.074856 0.177318 0.400271 -0.084598 -0.085787 -0.072897 -0.011490 0.397250 -0.090011 -0.091460 -0.253970 -0.250767
polarizability: 5.41760242e+02 -9.84841824e-02 1.75213213e+02 -2.71382520e-01 -1.97783715e-01 6.86078898e+01
1716.lowfreq: -9.9480 -0.0011 -0.0009 -0.0003 2.1503 2.9387 22.7049 33.1132 38.1938
frequency: 22.6706 33.1055 38.1924 63.2569 112.7389 115.0706 150.1725 179.9733 207.1547 212.0753 215.7703 269.4027 320.1981 390.8120 396.9816 404.8675 405.4367 469.1123 483.3642 517.9191 539.3876 547.8471 558.5240 568.2067 597.1801 640.7985 648.0243 702.1196 725.9770 734.8928 746.6523 756.2826 818.5694 833.8056 848.6003 855.2298 868.4866 914.9590 965.7148 981.9958 984.7395 989.8277 1002.6653 1002.8835 1112.4109 1117.8835 1160.4527 1169.7180 1186.1017 1199.6728 1206.4433 1220.7246 1268.0242 1302.5955 1312.2960 1348.5860 1360.3146 1371.0706 1425.0152 1430.7945 1475.7282 1485.8617 1515.7092 1557.3893 1576.3007 1609.4540 1620.3550 2173.0626 2173.8164 3134.7185 3153.9876 3156.5124 3160.3856 3170.0816 3175.9973 3179.2043 3190.9799 3385.7450
redmass: 3.8822 5.1665 8.9640 8.9465 9.6954 8.0595 8.5736 8.9588 5.6781 4.7136 8.1821 6.7457 6.8547 7.2105 8.2719 2.9625 2.9464 5.3175 6.1954 7.6980 8.8271 7.2067 3.0453 2.8930 6.8047 7.4366 7.2005 6.4777 1.3520 3.4782 3.6982 6.3298 6.4548 1.3217 1.2598 1.5296 1.6483 4.6533 1.3735 1.3679 1.3553 1.3589 2.8307 2.8130 1.5115 1.4415 3.3469 1.3899 1.2357 3.2157 2.6754 3.0503 2.1392 1.3046 1.3552 7.2980 5.2225 6.1664 4.0674 3.8475 1.8750 2.4106 3.1096 7.1681 5.2890 6.1889 6.2514 12.6286 12.6271 1.0897 1.0890 1.0886 1.0906 1.0963 1.0966 1.0977 1.0957 1.0748
irintensity: 0.5759 0.6884 2.3017 0.0126 0.3141 3.7621 5.8353 0.0462 8.6784 10.4221 0.5662 0.6306 1.3783 17.0014 0.5830 0.0376 0.0002 4.8588 0.0041 1.5356 5.0320 1.1810 26.4317 16.8973 25.7908 2.1786 1.9209 8.8463 76.7589 2.7012 4.5827 0.3912 0.0750 31.7457 3.1115 42.8475 104.3774 0.5671 0.0163 0.0233 0.0269 0.0019 2.3126 1.0563 42.1588 7.5779 257.2701 3.8008 29.4022 8.9955 1.8625 35.6125 446.1127 26.2850 1.0811 196.5946 25.9447 99.0435 6.6866 13.1849 93.5591 38.0877 331.0057 0.6827 16.9689 23.7956 241.8571 121.7014 47.2598 9.2215 3.3945 3.9902 3.7020 6.2281 7.7598 1.4359 0.8704 13.4833
temp: 298.150 k
press: 1.00000 atm
elementType: 7 7 7 7 7 6 6 6 6 6 6 6 6 6 6 6 6 6 6 1 1 1 1 1 1 1 1 1
symmnumber: 1
zpe: 525932.4 jmol-1
zpe.correction: 0.200317 hartree
zpe.thermalcorrener: 0.216210 hartree
zpe.thermalcorrenthalpy: 0.217154 hartree
zpe.thermalcorrgfe: 0.154622 hartree
zpe.sumelectzpe: -811.296633 hartree
zpe.sumelectthermal: -811.280740 hartree
zpe.sumelectthermalent: -811.279795 hartree
zpe.sumelectthermalfe: -811.342328 hartree
dipole: 0.7777 4.0967 0.0048
dipole: 4.1699
quadrupole: -189.7217 -97.7981 -113.2558
quadrupole: 4.0063 -0.1773 -0.1541
quadrupole: -56.1298 35.7937 20.3361 4.0063 -0.1773 -0.1541
hfenergy: -811.4969497 hartree
pointgroup: C01 [X(C14H9N5)]
dipole: 0.3367317 -1.3769097 -0.8259396 debye
polarizability: 541.0029228|-2.7885096|146.6241154|18.3132625|47.1538672|97.9543064 unknown
InChI: InChI=1S/C14H9N5/c15-9-11-1-5-13(6-2-11)17-19-18-14-7-3-12(10-16)4-8-14/h1-8,17H
charge 0 multiplicity 1
28 atoms
N  1.125949 -1.163813 -0.584175
N  -1.075431 -1.2055 -0.708483
N  -0.039581 -0.534016 -0.257765
N  7.326846 1.24357 1.148088
N  -7.397242 1.238664 0.541715
C  2.37874 -0.64479 -0.215057
C  3.544544 -1.37136 -0.582204
C  2.49806 0.574643 0.506819
C  -2.337932 -0.619273 -0.400498
C  4.944677 0.332231 0.490488
C  4.814732 -0.886852 -0.23238
C  3.770543 1.052998 0.853488
C  -3.466108 -1.33192 -0.889928
C  -2.531927 0.585118 0.338302
C  -4.962004 0.342218 0.086136
C  -4.767352 -0.85931 -0.651142
C  -3.83009 1.058121 0.577157
C  6.244578 0.829163 0.849041
C  -6.29075 0.832209 0.335073
H  3.454527 -2.311618 -1.13864
H  1.597081 1.126065 0.783699
H  5.711458 -1.446416 -0.514858
H  3.867332 1.99084 1.409045
H  -3.293746 -2.25348 -1.454079
H  -1.662513 1.131433 0.714369
H  1.053257 -2.04601 -1.116072
H  -5.6348 -1.409108 -1.02818
H  -3.98605 1.981693 1.14354
