program: Gaussian 09
title: 000277103
version: EM64L-G09RevD.01
frameworkgroup: C1[X(C6H12O2)]
method: RPBEPBE
basis: SDD
operation: Freq
keyword: #pfreq=noraman
keyword: PBEPBE/SDD
title: #p freq=noraman PBEPBE/SDD
converged: YES YES NO NO
title: Mulliken charges:
elementType: O O C C C C C C H H H H H H H H H H H H
charge: -0.436578 -0.436600 0.145927 0.322972 -0.468590 -0.468397 -0.812290 -0.812165 0.195328 0.221755 0.195341 0.221746 0.224494 0.282530 0.225676 0.282337 0.224523 0.225698 0.333149 0.333143
chargesum: 0.00000
title: Mulliken charges with hydrogens summed into heavy atoms:
elementType: O O C C C C C C
charge: -0.103428 -0.103456 0.145927 0.322972 -0.051507 -0.051309 -0.079590 -0.079607
polarizability: 7.41316855e+01 2.60463093e-02 8.89330473e+01 1.71318318e+00 -7.69398706e-03 6.07414555e+01
1716.lowfreq: -10.7474 -0.0009 -0.0009 0.0003 14.2802 16.7935 65.7473 66.2041 107.9364
frequency: 65.6323 66.0808 107.8720 110.3355 123.4934 162.3794 261.8057 277.7015 306.0429 325.1870 394.4314 402.0448 420.7967 490.9120 692.6687 694.7476 861.2476 912.1599 939.1139 948.3943 962.4297 962.8508 1001.1686 1084.3261 1129.7211 1131.8721 1193.0055 1200.8521 1277.3669 1295.3729 1303.7523 1376.2095 1380.7945 1388.7925 1398.4864 1450.4145 1455.8039 1470.3485 1473.8305 1496.9485 1504.0765 1662.2036 2954.5782 2962.0838 2965.0682 2969.7607 3035.8874 3039.6890 3066.3067 3069.7801 3113.8433 3115.8608 3555.3206 3555.7230
redmass: 3.3264 3.3030 1.0738 1.0420 2.7525 4.3106 1.2439 1.3023 2.0108 2.8934 2.5443 2.9783 2.0231 2.8170 3.6566 5.4891 2.5080 6.5272 2.8945 1.4950 1.3379 1.5431 1.5217 1.6887 1.6362 1.4280 1.4896 2.1808 2.2359 1.1678 1.4849 1.1794 1.2481 1.2326 1.1973 1.0708 1.0442 1.0837 1.0912 1.0605 1.0747 6.2091 1.0709 1.0679 1.0407 1.0417 1.0952 1.0946 1.0930 1.0938 1.0964 1.0972 1.0663 1.0664
irintensity: 3.9740 4.1051 1.2044 1.4491 1.5942 1.2796 16.7141 171.2013 10.7970 84.6155 29.1413 7.1624 22.2432 3.3901 11.5083 9.3591 0.9276 185.8087 8.4279 15.2100 14.0778 8.1849 5.2517 8.8679 15.0729 0.0089 5.2699 17.1035 25.0742 2.7642 6.6745 10.3699 50.9146 23.6747 24.8425 18.3238 7.1320 24.1465 1.4005 16.3185 3.4759 50.3739 46.3733 135.0271 11.5110 20.7917 3.5404 36.6521 40.6359 10.2632 14.5598 5.1120 7.8815 0.0923
temp: 298.150 k
press: 1.00000 atm
elementType: 8 8 6 6 6 6 6 6 1 1 1 1 1 1 1 1 1 1 1 1
symmnumber: 1
zpe: 446013.1 jmol-1
zpe.correction: 0.169877 hartree
zpe.thermalcorrener: 0.180689 hartree
zpe.thermalcorrenthalpy: 0.181634 hartree
zpe.thermalcorrgfe: 0.133604 hartree
zpe.sumelectzpe: -385.577231 hartree
zpe.sumelectthermal: -385.566419 hartree
zpe.sumelectthermalent: -385.565475 hartree
zpe.sumelectthermalfe: -385.613505 hartree
dipole: 0.0026 0.7756 -0.0034
dipole: 0.7756
quadrupole: -65.1374 -46.3248 -43.8676
quadrupole: 0.0162 -0.5843 -0.0048
quadrupole: -13.3608 5.4518 7.9090 0.0162 -0.5843 -0.0048
hfenergy: -385.7471084 hartree
pointgroup: C01 [X(C6H12O2)]
dipole: -0.3050811 0.0005865 0.006379 debye
dipolederiv: -0.6157208 -0.1679268 -0.0414574 -0.2799546 -0.5961429 0.2636129 -0.0071756 0.3414436 -0.4145745 -0.61053 0.178257 0.049676 0.2874624 -0.6006966 0.2541418 0.0162737 0.3356708 -0.4150979 -0.5701556 0.0019803 0.0050401 0.0040109 -0.1596529 0.1587523 0.0039118 0.0253856 -0.2976801 0.53744 0.0008827 -0.0088747 0.0006631 0.2204702 0.1209068 -0.0085411 0.1344287 -0.042084 0.4894105 0.0795004 0.0261208 0.1978528 0.4586666 -0.1885003 0.0742735 -0.2231633 0.4906925 0.4842987 -0.0863306 -0.0276335 -0.2032676 0.4614132 -0.1818183 -0.0758934 -0.2198546 0.493138 -0.1232298 -0.1117459 -0.0266147 -0.0349661 -0.1467723 -0.0627177 -0.0483427 -0.092881 0.0519473 -0.1193312 0.1086593 0.0315626 0.032953 -0.1475845 -0.0639843 0.0531435 -0.096668 0.0493457 -0.2006758 0.0635332 -0.0872958 0.0970202 -0.0205175 0.0789168 -0.0263132 0.0523697 0.0174534 0.0586877 0.0366706 0.0978333 -0.026612 -0.0366159 -0.0722312 0.0444621 -0.0416073 -0.0850359 -0.1982193 -0.0607314 0.0942591 -0.093474 -0.0193901 0.0809686 0.0331953 0.0538862 0.0140178 0.054072 -0.0383054 -0.1025263 0.0240919 -0.0363986 -0.0722653 -0.0488986 -0.0401276 -0.080836 -0.0427188 -0.0340717 0.1035405 -0.0418943 0.0845772 -0.0169874 0.1498709 0.0273193 -0.0094418 0.0729946 0.1008744 0.0150051 0.0397442 -0.0498671 -0.0260633 0.0140343 -0.026359 0.0996886 0.0224798 -0.0137618 -0.0900731 -0.0224471 0.0644121 0.048401 -0.1415536 0.0062397 -0.0762458 0.0707918 -0.1026849 -0.0140295 -0.041591 -0.0491849 -0.0244689 -0.0130891 -0.0228205 0.1005919 -0.0503967 0.0357276 -0.1023299 0.0419727 0.0840246 -0.0177482 -0.1483699 0.0271717 -0.0011863 0.0302685 0.0142942 0.086911 0.0244207 0.0641693 0.0468238 0.1380622 0.0046425 -0.0837638 0.3567416 0.0770607 0.0306817 0.111766 0.2115254 -0.1648907 0.0070303 -0.1239398 0.09411 0.3537926 -0.0818817 -0.0397953 -0.1177512 0.2135646 -0.1608483 -0.0160803 -0.1211365 0.094961 unknown
polarizability: 88.9251822|-0.0308473|74.2703774|-0.468655|1.0303168|60.6106288 unknown
InChI: InChI=1S/C6H12O2/c1-5(2)6(3-7)4-8/h7-8H,3-4H2,1-2H3
charge 0 multiplicity 1
20 atoms
O  1.115457 2.32163 -0.607518
O  1.114321 -2.33276 0.562943
C  0.326203 -0.001788 -0.008483
C  -1.048829 0.003337 0.013752
C  1.140072 1.22241 0.393659
C  1.117798 -1.231805 -0.436664
C  -1.879523 -1.216937 -0.344321
C  -1.858762 1.229688 0.397964
H  2.192863 0.92597 0.588361
H  0.75018 1.706304 1.304343
H  2.166685 -0.943403 -0.662165
H  0.697351 -1.711189 -1.336163
H  -2.681368 -1.361193 0.405613
H  -1.286418 -2.142494 -0.38462
H  -2.387195 -1.06816 -1.318757
H  -1.258399 2.151241 0.418055
H  -2.683668 1.37879 -0.325468
H  -2.335243 1.085146 1.388667
H  1.268945 1.928709 -1.504497
H  1.297632 -1.942796 1.455601
