program: Gaussian 09
title: 000277277
version: EM64L-G09RevD.01
frameworkgroup: C1[X(C26H19N3O8S2)]
method: RPBEPBE
basis: SDD
operation: Freq
keyword: #p
keyword: freq=noraman
keyword: PBEPBE/SDD
title: #p freq=noraman PBEPBE/SDD
converged: YES YES NO NO
title: Mulliken charges:
elementType: S S O O O O O O O O N N N C C C C C C C C C C C C C C C C C C C C C C C C C C H H H H H H H H H H H H H H H H H H H
charge: 0.974592 0.959932 -0.306806 -0.296133 -0.560131 -0.480342 -0.513260 -0.548604 -0.513656 -0.504191 -0.491207 -0.664041 -0.693070 0.081625 0.193108 0.316619 0.393200 -0.381418 0.294141 -0.131440 0.279902 -0.165969 -0.435198 0.430280 -0.383675 -0.381064 0.347640 0.437775 -0.391705 -0.448405 -0.227673 -0.227863 -0.398509 -0.361391 -0.267202 -0.355458 -0.475041 0.543171 -0.441686 0.331956 0.382993 0.293650 0.294827 0.359257 0.392259 0.270670 0.254299 0.239785 0.239887 0.250210 0.286363 0.257093 0.300022 0.229440 0.385555 0.323636 0.317085 0.384167
chargesum: 0.00000
title: Mulliken charges with hydrogens summed into heavy atoms:
elementType: S S O O O O O O O O N N N C C C C C C C C C C C C C C C C C C C C C C C C C C
charge: 0.974592 0.959932 -0.306806 -0.296133 -0.174576 -0.480342 -0.513260 -0.164437 -0.513656 -0.504191 -0.108214 0.087475 -0.052348 0.081625 0.193108 0.316619 0.393200 -0.381418 0.294141 -0.131440 0.279902 -0.165969 -0.103242 0.430280 -0.090026 -0.086237 0.347640 0.437775 -0.121035 -0.194106 0.012112 0.012024 -0.148300 -0.075027 -0.267202 -0.098364 -0.175019 0.543171 -0.212246
polarizability: 8.79711923e+02 -8.25227422e+01 4.40743985e+02 3.33056867e+01 -1.19050026e+01 2.57846514e+02
1716.lowfreq: -3.5183 0.0015 0.0017 0.0017 3.0506 4.3806 10.1317 14.2574 19.6490
frequency: 9.9108 14.2374 19.6170 30.1592 40.1379 41.7019 48.8087 61.4099 73.8622 91.7402 95.8505 104.3261 111.3878 127.3445 142.0169 144.4277 151.3815 154.5502 170.4319 175.3421 180.8094 200.7738 210.6065 219.2360 223.1356 234.2679 240.4001 257.9686 275.4564 281.0370 298.7168 306.3872 317.7344 319.1360 329.8575 337.3317 361.1165 376.3822 380.2694 381.7599 397.1604 400.9620 404.9960 410.9843 423.1854 425.5628 427.8419 428.7743 445.6476 457.3258 461.1406 476.9325 486.4713 510.7305 516.8155 538.0866 546.2100 549.8028 553.5312 583.1079 598.7160 625.0027 631.5704 650.1817 654.2267 663.4540 671.5557 680.8917 712.6085 715.0344 722.8750 735.6632 739.3312 770.2309 788.6557 807.8940 813.6945 822.5226 825.8562 826.3506 835.5163 845.0895 856.0240 865.2510 875.0230 877.1050 880.4142 884.9286 911.1873 927.1780 935.4184 942.8558 950.5244 957.0507 961.5561 972.3869 977.5318 981.0097 998.0099 1006.0491 1014.8943 1022.6554 1030.5219 1043.8682 1051.8010 1058.4169 1068.2843 1089.2720 1129.9501 1137.5874 1150.2777 1169.5968 1178.8229 1203.2402 1244.3551 1246.5294 1248.5353 1274.2160 1284.1792 1293.6112 1311.6749 1321.5061 1328.3652 1347.6008 1349.6002 1364.5328 1375.2314 1386.7088 1406.6532 1422.6731 1423.9982 1438.6059 1450.9903 1454.9937 1474.5714 1492.9978 1509.7088 1525.1006 1526.6968 1541.6547 1556.9867 1571.6340 1590.6319 1603.5188 1608.1984 1615.9939 1635.1862 1635.9998 1649.0052 3002.0418 3130.2674 3135.4784 3137.5269 3139.7992 3141.4808 3153.5181 3154.1951 3155.6129 3161.2631 3167.3673 3174.9391 3179.1321 3217.7607 3470.0503 3475.2782 3479.6608 3563.8141 3703.1440
redmass: 9.7556 7.5554 7.1495 7.8467 8.5056 8.2350 8.1046 5.4932 5.2118 5.7103 6.8019 6.6344 5.8240 7.3002 6.9828 6.1756 3.6138 3.4298 5.3751 4.7602 2.3380 7.2589 6.1330 4.4923 5.6279 3.2116 5.4542 3.2533 3.8024 5.8506 5.8428 6.4305 7.5709 8.2472 8.6799 6.2655 5.8145 1.8349 2.3300 6.3015 2.6198 9.1132 6.1674 3.2034 7.6601 6.3631 2.1995 1.8123 5.5946 10.9274 3.7731 7.7296 4.5351 6.3252 5.2687 5.2412 6.7792 8.4595 4.9583 5.5524 4.0894 5.2229 6.1924 6.4363 6.2785 7.0452 2.8013 5.8424 1.7064 3.3243 3.6564 2.6816 3.6578 5.5351 4.6781 1.9542 3.2035 4.3803 2.9274 2.3208 1.6973 1.5903 6.9877 1.2742 6.6530 2.4164 1.5812 3.0880 1.6591 1.4567 2.0790 5.6542 10.4149 1.4248 1.4569 1.4637 3.9504 5.8708 1.3872 2.8976 1.3638 2.7257 1.6932 1.1602 2.1307 2.1052 1.2303 2.4309 1.4856 2.2697 1.3279 1.2198 1.8746 1.1347 2.6466 1.5880 1.4357 2.4085 2.1009 1.9767 2.6401 1.7451 3.1411 2.8075 3.5097 4.6693 4.9292 9.8809 9.0728 3.8654 3.5382 4.2960 2.9416 4.6925 3.0113 2.8923 6.9000 3.8987 5.5706 6.7564 5.2706 2.8328 1.6646 2.9187 5.5654 5.7066 3.9383 3.7568 1.5383 1.0832 1.0879 1.0880 1.0865 1.0915 1.0904 1.0928 1.0908 1.0957 1.0949 1.0945 1.0996 1.0952 1.0590 1.0929 1.0695 1.0662 1.0453 1.1042
irintensity: 0.7304 0.7556 0.3503 0.8991 0.5104 0.6436 0.3879 0.7379 2.4472 1.2446 2.5163 0.4803 0.8331 3.3039 2.0712 3.4968 47.5796 26.8225 14.6550 11.4638 22.4990 11.2133 6.2106 10.9958 1.8967 1.6534 1.8729 66.5581 22.1891 7.8062 51.6548 5.6009 3.8213 10.4592 12.0262 12.3942 14.0600 16.7478 4.6576 19.8920 1.2915 5.5396 28.8630 4.9615 71.2756 41.9258 105.0161 183.8874 4.3090 22.3979 2.6937 13.9897 21.5535 15.8411 20.7976 24.2700 127.0396 95.5919 23.7053 6.8327 7.2058 10.0216 0.7769 8.6885 12.8954 8.8053 21.0052 6.3846 60.1038 10.9409 22.9220 10.5179 9.3848 1.1846 8.3268 53.3503 0.0674 133.2263 51.4342 14.7777 28.2540 18.1943 8.6780 119.2738 26.2792 39.3608 32.8604 82.0272 78.8914 2.0544 0.4235 151.2026 60.7493 3.2222 4.2287 3.3570 2.7056 6.5912 4.9274 19.9025 0.0543 38.1445 0.6601 83.0138 10.3965 17.8647 48.7993 7.0217 10.7269 60.6801 14.8576 15.8579 5.1711 3.1700 10.8801 8.2882 34.1759 56.3445 26.1821 90.5506 615.9143 203.2363 35.5891 7.6203 258.2934 9.9691 15.9017 4.5342 46.1169 8.5105 69.6466 15.8985 16.7266 26.4414 22.2048 421.6437 96.5498 189.9447 449.6563 11.0573 12.1479 20.1088 201.8357 109.4620 9.5537 20.3801 89.2815 38.5792 493.2816 33.1252 27.6391 9.2730 3.6052 11.8613 5.5181 10.8580 14.8073 13.8940 9.0468 1.1141 38.0927 0.6714 46.9657 216.4892 27.3488 36.8711 201.3397 27.1377
temp: 298.150 k
press: 1.00000 atm
elementType: 16 16 8 8 8 8 8 8 8 8 7 7 7 6 6 6 6 6 6 6 6 6 6 6 6 6 6 6 6 6 6 6 6 6 6 6 6 6 6 1 1 1 1 1 1 1 1 1 1 1 1 1 1 1 1 1 1 1
symmnumber: 1
zpe: 1061606.1 jmol-1
zpe.correction: 0.404344 hartree
zpe.thermalcorrener: 0.439949 hartree
zpe.thermalcorrenthalpy: 0.440893 hartree
zpe.thermalcorrgfe: 0.334671 hartree
zpe.sumelectzpe: -2561.320538 hartree
zpe.sumelectthermal: -2561.284934 hartree
zpe.sumelectthermalent: -2561.283990 hartree
zpe.sumelectthermalfe: -2561.390212 hartree
dipole: -2.3852 -1.4824 -6.8485
dipole: 7.4019
quadrupole: -187.1585 -242.1447 -238.1132
quadrupole: -17.3922 43.2994 -7.2690
quadrupole: 35.3136 -19.6726 -15.6410 -17.3922 43.2994 -7.2690
hfenergy: -2561.7248828 hartree
pointgroup: C01 [X(C26H19N3O8S2)]
dipole: 0.9844478 1.4043234 -2.3535828 debye
polarizability: 888.6257359|-51.8074258|412.4679258|-32.5788726|57.5942037|277.2087604 unknown
InChI: InChI=1S/C26H19N3O8S2/c27-14-7-10-16(20(11-14)38(32,33)34)13-5-8-15(9-6-13)29-19-12-21(39(35,36)37)24(28)23-22(19)25(30)17-3-1-2-4-18(17)26(23)31/h1-12,29,32,35H,27-28H2
charge 0 multiplicity 1
58 atoms
S  -1.663884 -4.018823 -1.04745
S  5.810961 0.007928 2.241985
O  -2.52616 2.542334 0.866158
O  -6.418241 -1.112735 -0.570258
O  -1.46899 -3.671453 -2.864362
O  -0.203571 -4.270118 -0.407032
O  -2.827458 -5.143389 -0.874512
O  4.75863 -1.454676 1.823439
O  4.928958 1.017137 3.154857
O  7.221461 -0.503197 2.846084
N  -0.659215 0.877079 0.350022
N  -4.643607 -2.940389 -0.964133
N  9.231346 1.069731 -1.489078
C  -3.035897 0.310797 0.072674
C  -4.053544 -0.654773 -0.265072
C  -1.63699 -0.050733 0.034526
C  -3.701601 -2.009828 -0.63825
C  -2.293219 -2.309173 -0.603493
C  -4.844134 2.052762 0.491695
C  -3.416087 1.672809 0.48998
C  -5.845199 1.106982 0.131543
C  -5.4798 -0.278391 -0.252222
C  -1.2974 -1.401677 -0.29217
C  0.74217 0.801733 0.150213
C  -5.219538 3.370419 0.862738
C  -7.210999 1.489943 0.143937
C  3.586857 0.838883 -0.191917
C  5.054794 0.879851 -0.450099
C  1.344915 0.132427 -0.950955
C  1.576958 1.510151 1.056609
C  -6.576021 3.742415 0.870544
C  -7.575179 2.798973 0.509733
C  2.742713 0.153028 -1.107592
C  2.972343 1.532051 0.886815
C  6.106252 0.589492 0.454559
C  5.510437 1.231981 -1.75782
C  7.474565 0.634635 0.15339
C  7.884087 1.005556 -1.157325
C  6.866241 1.300618 -2.11102
H  -0.257851 -1.739535 -0.24275
H  -1.079437 1.768295 0.72028
H  -4.428889 4.074524 1.138006
H  -7.95834 0.741742 -0.135986
H  -4.374004 -3.919461 -1.113644
H  -5.624667 -2.603458 -0.939992
H  0.729781 -0.366294 -1.70613
H  1.123091 2.041177 1.900623
H  -6.863173 4.760128 1.155456
H  -8.630608 3.091322 0.517841
H  3.190067 -0.3877 -1.948994
H  3.585793 2.08796 1.59982
H  4.752526 1.48695 -2.506372
H  8.206084 0.353995 0.919436
H  7.145387 1.589528 -3.130935
H  -1.169105 -4.51997 -3.305093
H  9.949941 0.853445 -0.8040
H  9.524816 1.321459 -2.428522
H  4.18633 -1.637268 2.624818
