program: Gaussian 09
title: 000277106
version: EM64L-G09RevD.01
frameworkgroup: C1[X(C13H18O3)]
method: RPBEPBE
basis: SDD
operation: Freq
keyword: #pfreq=noraman
keyword: PBEPBE/SDD
title: #p freq=noraman PBEPBE/SDD
converged: YES YES NO NO
title: Mulliken charges:
elementType: O O O C C C C C C C C C C C C C H H H H H H H H H H H H H H H H H H
charge: -0.274320 -0.222867 -0.234231 0.083399 -0.152906 -0.542897 0.491779 -0.462361 -0.561367 -0.550253 0.204385 -0.552539 -0.755612 0.189197 -0.263161 -0.663364 0.250940 0.238491 0.246307 0.224255 0.239503 0.232543 0.253830 0.243275 0.244868 0.261657 0.218961 0.224485 0.229539 0.223889 0.234930 0.220842 0.252152 0.226650
chargesum: 0.00000
title: Mulliken charges with hydrogens summed into heavy atoms:
elementType: O O O C C C C C C C C C C C C C
charge: -0.274320 -0.222867 -0.234231 0.083399 0.098034 -0.058099 0.491779 0.001397 -0.074994 -0.062109 0.204385 -0.290882 -0.082627 0.189197 0.195658 0.036280
polarizability: 1.49379307e+02 -7.30665556e+00 1.56558646e+02 -8.03256872e+00 3.61847749e-01 1.23778833e+02
1716.lowfreq: -9.1839 -0.0006 -0.0004 0.0005 3.4543 10.5296 22.0421 46.0104 66.0068
frequency: 19.3249 45.9402 65.9479 84.5244 118.4769 131.4197 168.1497 168.2879 187.7337 212.0068 218.2592 247.3046 281.9176 314.7756 334.7264 351.3802 399.0752 426.5405 434.8329 467.2335 485.6775 531.3768 566.7416 593.9492 636.4231 671.7459 709.4671 733.1160 784.1896 813.7110 818.8013 821.9539 861.9896 879.3211 897.8232 913.1689 920.2377 931.4555 977.0491 1010.1980 1018.5475 1053.2444 1057.5880 1066.1500 1084.1050 1093.2162 1101.7602 1126.5837 1143.2625 1154.8770 1173.7731 1198.4619 1217.9501 1231.2512 1242.4666 1264.8236 1275.5602 1278.1306 1293.5846 1314.1067 1321.2442 1343.8160 1347.0151 1354.4391 1390.0520 1391.1868 1438.9447 1440.1747 1454.8908 1465.0639 1471.6964 1481.0801 1485.3078 1485.3836 1487.5087 1583.7714 1609.0071 1657.5810 2968.8014 2982.3438 2989.2645 2992.6185 3013.3875 3020.7732 3030.0808 3031.0871 3049.8114 3061.6843 3073.8577 3076.4291 3081.7198 3087.5817 3090.0734 3092.8750 3119.0272 3132.0801
redmass: 3.8855 4.1653 4.8849 3.6839 2.6088 3.2050 2.7423 2.6482 2.9038 1.6578 1.3390 1.9235 2.1610 2.5840 2.8880 3.5876 3.8185 5.1816 4.1270 4.0143 3.0837 3.3218 2.5582 2.7269 3.5102 3.0937 5.3653 3.5376 2.1917 1.5219 2.1892 2.5481 2.2032 1.8899 1.8789 2.1470 1.7291 2.1012 1.8800 2.6212 2.3264 1.9941 1.7086 3.6416 2.2129 2.2613 2.3472 1.9918 1.7744 1.6492 1.4659 2.3915 1.4523 1.5706 2.0500 1.7125 1.6585 1.1805 1.3552 1.4229 1.6633 1.4508 1.6013 1.2929 1.2025 1.2285 1.0807 1.0790 1.0995 1.0428 1.0739 1.0621 1.0491 1.0517 1.0920 9.8620 9.6249 8.9221 1.0657 1.0360 1.0632 1.0360 1.0599 1.0645 1.0619 1.0824 1.0965 1.0942 1.0990 1.1015 1.0994 1.0975 1.1048 1.1032 1.1064 1.0925
irintensity: 0.7359 1.8753 2.4040 1.0192 0.2259 1.8989 0.9955 0.4781 1.2790 2.1663 2.1709 0.2209 0.7351 12.5267 6.0924 2.0981 3.2642 0.4650 11.2486 3.9377 5.6739 3.1495 3.1352 0.9698 4.2388 0.5251 3.2644 6.5366 5.1078 2.7301 3.6511 1.1552 0.3439 7.1913 7.0628 3.3268 19.5191 13.1184 3.2433 34.9783 4.3518 120.4851 27.4617 9.7108 11.9465 106.0703 52.5469 55.8079 11.0472 12.3781 12.6869 35.0409 15.0819 5.4285 50.0529 26.1729 14.2554 2.5041 16.8779 3.4769 14.7085 4.9942 5.1873 1.6667 18.2661 27.1103 15.3412 10.5136 13.7399 16.2034 6.5315 4.8147 18.8470 14.0083 9.1611 198.9178 124.5982 90.0538 17.6659 22.0705 16.7554 15.1590 19.6919 30.1700 35.2936 4.0708 7.5074 12.0208 42.2980 11.2615 33.3503 37.9390 37.5144 1.7035 29.0906 7.0464
temp: 298.150 k
press: 1.00000 atm
elementType: 8 8 8 6 6 6 6 6 6 6 6 6 6 6 6 6 1 1 1 1 1 1 1 1 1 1 1 1 1 1 1 1 1 1
symmnumber: 1
zpe: 746035.3 jmol-1
zpe.correction: 0.284150 hartree
zpe.thermalcorrener: 0.300216 hartree
zpe.thermalcorrenthalpy: 0.301160 hartree
zpe.thermalcorrgfe: 0.240126 hartree
zpe.sumelectzpe: -730.625442 hartree
zpe.sumelectthermal: -730.609376 hartree
zpe.sumelectthermalent: -730.608432 hartree
zpe.sumelectthermalfe: -730.669466 hartree
dipole: -3.1967 3.3486 2.9227
dipole: 5.4748
quadrupole: -92.2310 -99.4961 -99.2301
quadrupole: 14.3246 1.9807 -4.6910
quadrupole: 4.7547 -2.5104 -2.2443 14.3246 1.9807 -4.6910
hfenergy: -730.9095921 hartree
pointgroup: C01 [X(C13H18O3)]
dipole: -1.493207 1.2512676 0.9188253 debye
polarizability: 152.1063705|-7.6830807|155.5131786|-3.7415765|-1.9463968|122.0972364 unknown
InChI: InChI=1S/C13H18O3/c1-3-16-12(15)13-6-4-5-10(13)8-11(14)7-9(13)2/h8-9H,3-7H2,1-2H3
charge 0 multiplicity 1
34 atoms
O  -2.368415 -0.17113 0.469192
O  -1.387641 0.404799 -1.561782
O  2.707918 -2.477888 -0.473011
C  -0.054841 0.567703 0.548211
C  0.217554 -0.599796 1.555758
C  -0.280012 2.00212 1.145291
C  1.140156 0.800014 -0.387081
C  0.023244 2.950917 -0.045842
C  1.208745 2.26545 -0.791023
C  0.677007 -1.838418 0.735568
C  -1.297249 0.251603 -0.321411
C  2.023124 -0.188917 -0.708182
C  1.249262 -0.248256 2.65182
C  1.879024 -1.562557 -0.179818
C  -3.650621 -0.472158 -0.246514
C  -3.653932 -1.910614 -0.77008
H  -0.739142 -0.848957 2.04957
H  0.455795 2.169334 1.952521
H  -1.289718 2.130784 1.571006
H  0.271245 3.973686 0.28621
H  -0.851712 3.01861 -0.716201
H  2.18105 2.696026 -0.480448
H  1.141099 2.382453 -1.887604
H  -0.155546 -2.189312 0.089389
H  0.940104 -2.682807 1.39694
H  2.892189 -0.003023 -1.351227
H  0.874342 0.533072 3.336366
H  1.458047 -1.145831 3.262288
H  2.209875 0.094454 2.225726
H  -4.419103 -0.307823 0.525633
H  -3.769785 0.254797 -1.068872
H  -4.637561 -2.139117 -1.220825
H  -2.882262 -2.047848 -1.546033
H  -3.47564 -2.629969 0.047868
