program: Gaussian 09
title: 000277096
version: EM64L-G09RevD.01
frameworkgroup: C1[X(C14H22O)]
method: RPBEPBE
basis: SDD
operation: Freq
keyword: #pfreq=noraman
keyword: PBEPBE/SDD
title: #p freq=noraman PBEPBE/SDD
converged: YES YES NO NO
title: Mulliken charges:
elementType: O C C C C C C C C C C C C C C H H H H H H H H H H H H H H H H H H H H H H
charge: -0.295586 0.261872 -0.466821 -0.519441 0.399844 -0.450038 -0.524077 -0.788883 0.059526 -0.438350 -0.434663 0.166678 -0.837403 -0.213832 -0.680620 0.198827 0.199962 0.207521 0.223416 0.204944 0.204597 0.226031 0.224557 0.224819 0.233057 0.209606 0.209064 0.208966 0.221362 0.220216 0.263195 0.219221 0.198429 0.200862 0.204251 0.229295 0.229596
chargesum: 0.00000
title: Mulliken charges with hydrogens summed into heavy atoms:
elementType: O C C C C C C C C C C C C C C
charge: -0.295586 0.261872 -0.068031 -0.088504 0.399844 -0.040497 -0.073489 -0.121401 0.059526 -0.020321 -0.213301 0.166678 -0.134771 0.185459 -0.017478
polarizability: 2.15347898e+02 2.16567386e+01 1.51977929e+02 -9.31839295e-01 5.44122233e-01 1.10773515e+02
1716.lowfreq: -17.0500 -0.0009 -0.0006 -0.0005 5.8112 14.0065 47.9444 60.7419 75.0338
frequency: 47.8770 60.7234 75.0265 95.4970 146.3540 163.8159 188.6387 190.6462 223.1155 238.6163 242.7954 271.2297 281.3357 293.8798 325.3926 343.9441 348.5927 377.2702 434.8483 438.2509 496.0927 506.5051 526.8024 605.6196 624.2916 661.5688 679.8081 740.7304 800.7386 812.4759 815.9295 859.1516 862.1555 876.6506 903.2334 921.8549 946.8541 970.0692 1002.4809 1016.3968 1025.5084 1030.0038 1038.5205 1047.9830 1091.6063 1100.4872 1108.8133 1114.6458 1130.7366 1147.7134 1153.5304 1169.4033 1188.6178 1211.5434 1219.2308 1245.6705 1255.7402 1274.3079 1290.4675 1323.2049 1336.5298 1342.3065 1344.3682 1350.3710 1361.3652 1368.5115 1385.0774 1392.0830 1396.8475 1452.3086 1454.1308 1456.2298 1459.3693 1467.6581 1468.5041 1470.6451 1477.0574 1478.0885 1481.9097 1490.0411 1496.0507 1634.9932 1648.8679 2933.1320 2948.5095 2956.7686 2959.5060 2970.1783 2971.0474 2974.7640 2979.4217 2993.9708 2994.5824 2999.8556 3012.3333 3017.3602 3034.2642 3041.3853 3042.8239 3068.3809 3085.5390 3091.6928 3103.8892 3109.1688 3112.2184
redmass: 3.2943 1.9900 2.2466 3.4667 2.8291 2.2353 1.1617 1.2740 2.3906 1.5142 1.4707 3.4817 2.5385 1.8977 2.5357 2.6085 2.9494 2.7905 3.5142 3.4214 2.8712 3.6774 3.0301 3.1524 3.8375 3.5834 2.8496 2.3881 1.6941 1.5670 1.2394 1.9372 2.0301 1.7711 2.1357 1.8661 1.8405 1.9583 1.7656 2.0441 1.9836 2.5126 1.5360 1.9248 2.3492 1.7706 1.6040 2.0377 1.4231 1.2832 2.8234 2.2266 2.0370 1.8364 1.5889 1.5278 1.1825 1.6438 1.8168 1.4743 1.4036 1.8161 1.4791 1.6220 1.3018 1.6688 1.2460 1.4558 1.2668 1.0884 1.0844 1.0813 1.0405 1.0840 1.0728 1.0700 1.0816 1.0543 1.0535 1.0755 1.0650 6.8631 7.3162 1.0656 1.0589 1.0579 1.0595 1.0411 1.0483 1.0501 1.0785 1.0764 1.0374 1.0958 1.1054 1.0982 1.1025 1.0965 1.1025 1.0962 1.0983 1.0988 1.1013 1.0923 1.0923
irintensity: 1.0304 4.3931 0.6439 1.9354 2.6430 0.8557 0.2693 0.5826 2.6193 0.8576 1.3900 0.3952 1.1255 1.5591 1.8817 0.9429 0.7762 1.8394 1.3522 0.2393 2.3879 1.9243 0.8022 1.3209 7.9023 0.7281 12.8786 4.1656 14.3712 5.0985 2.6684 3.2995 16.1476 5.1411 4.1152 27.9925 3.9818 5.4351 12.6173 5.0458 15.0627 29.3891 14.6328 40.2601 102.0626 5.9556 2.5565 52.8333 10.4032 11.6545 53.4531 78.2422 24.5218 19.5863 4.9504 0.4269 5.3654 2.2185 0.7612 3.3548 5.3128 7.0952 1.3520 45.6107 18.5386 9.0377 21.4731 13.6891 27.3878 5.9172 5.0385 8.2351 11.7113 13.7104 1.4437 0.6552 16.6106 11.2731 12.2502 6.1658 10.9123 9.1853 64.3519 58.1666 11.3166 100.2459 28.1360 44.3024 26.6185 49.0394 18.7072 77.6653 19.4882 22.6351 47.9495 49.0069 47.5785 20.1071 81.3545 36.1058 25.3432 35.2387 36.6943 29.0401 7.7177
temp: 298.150 k
press: 1.00000 atm
elementType: 8 6 6 6 6 6 6 6 6 6 6 6 6 6 6 1 1 1 1 1 1 1 1 1 1 1 1 1 1 1 1 1 1 1 1 1 1
symmnumber: 1
zpe: 856520.8 jmol-1
zpe.correction: 0.326232 hartree
zpe.thermalcorrener: 0.342068 hartree
zpe.thermalcorrenthalpy: 0.343012 hartree
zpe.thermalcorrgfe: 0.284109 hartree
zpe.sumelectzpe: -620.711232 hartree
zpe.sumelectthermal: -620.695396 hartree
zpe.sumelectthermalent: -620.694452 hartree
zpe.sumelectthermalfe: -620.753355 hartree
dipole: -0.6048 -1.8061 0.4247
dipole: 1.9515
quadrupole: -84.4208 -90.3327 -93.9461
quadrupole: 4.7232 -2.3779 0.6153
quadrupole: 5.1458 -0.7662 -4.3796 4.7232 -2.3779 0.6153
hfenergy: -621.0374636 hartree
pointgroup: C01 [X(C14H22O1)]
dipole: -0.2181043 0.695334 -0.2416777 debye
polarizability: 214.2274088|-22.7259452|152.6284068|5.1372886|-4.0915167|111.243526 unknown
InChI: InChI=1S/C14H22O/c1-4-15-13-8-10-14(3)9-6-5-7-12(14)11(13)2/h7H,4-6,8-10H2,1-3H3
charge 0 multiplicity 1
37 atoms
O  -2.790779 -0.338293 0.155415
C  1.361139 0.814501 -0.196713
C  2.815158 1.073288 0.290881
C  0.391683 1.712462 0.622789
C  0.965008 -0.655277 0.043528
C  3.81359 0.019625 -0.233647
C  -1.085305 1.503702 0.225783
C  1.238693 1.157786 -1.711837
C  -0.481982 -0.978848 0.052182
C  3.413769 -1.392293 0.252958
C  1.916463 -1.627573 0.220257
C  -1.41884 0.028808 0.104934
C  -0.920348 -2.432842 0.023913
C  -3.768666 0.566461 -0.486459
C  -5.141262 -0.083704 -0.320428
H  2.828547 1.057048 1.400716
H  3.12789 2.090328 -0.021211
H  0.667526 2.777967 0.490485
H  0.512862 1.47123 1.697282
H  4.840008 0.262272 0.102163
H  3.830974 0.039392 -1.34034
H  -1.301641 2.033552 -0.725484
H  -1.739922 1.965245 0.992726
H  1.978702 0.594032 -2.305747
H  0.240513 0.897816 -2.105435
H  1.410895 2.239047 -1.878936
H  3.774401 -1.544536 1.294674
H  3.930621 -2.165874 -0.351635
H  1.593931 -2.662466 0.397349
H  -0.422575 -2.981935 -0.797526
H  -2.010766 -2.5036 -0.105945
H  -0.658768 -2.949426 0.968389
H  -3.746196 1.564573 -0.004754
H  -3.510009 0.688217 -1.55914
H  -5.923277 0.547815 -0.780579
H  -5.161396 -1.076123 -0.802268
H  -5.379244 -0.214176 0.749259
