program: Gaussian 09
title: 000277084
version: EM64L-G09RevD.01
frameworkgroup: C1[X(C10H16O4)]
method: RPBEPBE
basis: SDD
operation: Freq
keyword: #pfreq=noraman
keyword: PBEPBE/SDD
title: #p freq=noraman PBEPBE/SDD
converged: NO YES NO NO
title: Mulliken charges:
elementType: O O O O C C C C C C C C C C H H H H H H H H H H H H H H H H
charge: -0.414872 -0.235711 -0.418341 -0.229146 0.047533 -0.519874 -0.109606 -0.458213 -0.446576 -0.411506 -0.448667 -0.499482 0.124148 0.167770 0.191846 0.214600 0.228351 0.249096 0.197250 0.212675 0.212454 0.224129 0.206859 0.197520 0.232254 0.219125 0.263727 0.250213 0.375507 0.376936
chargesum: 0.00000
title: Mulliken charges with hydrogens summed into heavy atoms:
elementType: O O O O C C C C C C C C C C
charge: -0.039365 -0.235711 -0.041406 -0.229146 0.239379 -0.076923 0.139491 -0.048288 -0.009993 -0.007127 0.002712 0.014459 0.124148 0.167770
polarizability: 1.44766525e+02 -5.95113946e+00 1.12448514e+02 -6.01069279e-01 -2.38154797e+00 9.38619230e+01
1716.lowfreq: -13.7393 -9.2596 -0.0010 -0.0006 0.0005 2.6227 13.3415 14.3822 45.2313
frequency: -10.0034 13.3601 44.9505 64.9432 74.1395 113.8628 151.9746 164.2804 200.6109 241.7026 280.4234 313.4061 316.0325 413.4998 443.7547 466.1661 491.1278 508.1509 529.2326 591.6464 612.5607 624.2137 643.5290 723.0677 756.7677 784.0633 827.2890 860.0053 868.3688 881.3793 906.1573 938.9516 958.4314 984.5547 1026.8273 1049.1726 1054.0309 1070.6644 1079.9385 1095.4689 1107.8963 1125.4454 1135.8576 1166.1821 1211.1003 1228.0592 1239.7264 1254.9757 1262.4717 1273.2991 1281.6716 1302.5740 1314.0840 1322.6165 1329.7913 1340.3415 1343.6981 1360.4804 1365.7289 1375.2948 1437.5441 1459.8444 1462.5738 1467.6872 1470.1992 1477.1781 1658.3840 1668.8642 2932.2270 2961.5276 2969.3480 2976.2951 2980.8082 2987.1767 2988.4619 3018.7560 3026.8302 3033.2275 3036.2246 3041.5485 3056.2094 3061.0063 3496.2195 3509.3957
redmass: 8.1675 9.9568 3.8947 5.4312 2.3660 2.9329 5.1241 2.4825 5.5351 2.2787 3.6183 5.2068 2.6978 2.1136 3.3371 2.7699 2.9552 1.9341 2.4080 4.1249 3.6110 1.3102 1.3273 4.1628 1.6589 1.6509 2.3713 1.9849 3.3130 1.8079 2.2651 2.5554 2.4427 1.7350 3.3774 2.1163 1.8010 1.7272 1.3847 2.5623 2.2358 2.8292 1.8719 1.5300 1.3556 1.3434 1.4624 1.3101 1.3352 1.2590 1.2065 1.3368 1.3429 1.3462 1.3913 1.4974 1.5168 1.5649 1.7781 1.7217 1.0835 1.0885 1.0885 1.0843 1.0880 1.0899 8.1372 8.1781 1.0816 1.0627 1.0628 1.0597 1.0636 1.0610 1.0615 1.0878 1.0966 1.0984 1.0992 1.1012 1.1012 1.0984 1.0637 1.0639
irintensity: 2.2487 0.9138 0.1689 0.1580 0.1765 1.2902 0.8331 0.3298 1.8033 1.0254 1.1011 6.3173 1.9741 4.4206 1.1258 30.8037 9.8892 31.3050 18.2427 3.8226 30.7022 97.5745 130.2190 53.3900 4.8131 5.2681 4.6336 4.8407 3.1650 11.2164 3.3835 2.9054 11.6895 13.2161 337.1911 128.2629 1.8798 89.3909 27.4304 0.5177 0.7338 2.7157 12.3127 9.9523 2.3534 11.4950 2.8697 1.4141 10.4422 23.0239 0.5645 12.6834 5.9200 3.7159 18.9873 24.8125 14.4526 5.9929 56.7982 10.4442 24.1799 1.7209 6.6257 12.4789 16.6927 12.9329 193.1038 215.9976 16.2727 33.6184 35.4545 11.1911 14.9170 20.7561 28.9138 7.1796 47.5980 28.7638 27.2967 18.3057 56.5275 49.7801 17.7917 19.5858
temp: 298.150 k
press: 1.00000 atm
elementType: 8 8 8 8 6 6 6 6 6 6 6 6 6 6 1 1 1 1 1 1 1 1 1 1 1 1 1 1 1 1
symmnumber: 1
zpe: 656077.2 jmol-1
zpe.correction: 0.249887 hartree
zpe.thermalcorrener: 0.263609 hartree
zpe.thermalcorrenthalpy: 0.264554 hartree
zpe.thermalcorrgfe: 0.207123 hartree
zpe.sumelectzpe: -690.482643 hartree
zpe.sumelectthermal: -690.468921 hartree
zpe.sumelectthermalent: -690.467976 hartree
zpe.sumelectthermalfe: -690.525407 hartree
dipole: -0.4638 2.0150 -1.7446
dipole: 2.7054
quadrupole: -79.1068 -86.9607 -88.0118
quadrupole: -4.3389 -4.4265 3.9293
quadrupole: 5.5863 -2.2676 -3.3187 -4.3389 -4.4265 3.9293
hfenergy: -690.73253 hartree
pointgroup: C01[X(C10H16O4)]
dipole: -0.1803008 -0.8920025 0.5520322 debye
polarizability: 144.9310091|5.4411426|112.6000772|0.4679788|0.5992447|93.5458757 unknown
InChI: InChI=1S/C10H16O4/c11-9(12)5-4-7-2-1-3-8(6-7)10(13)14/h7-8,11,13H,1-6H2
charge 0 multiplicity 1
30 atoms
O  4.202155 1.102111 1.229802
O  3.799199 1.250563 -1.050319
O  -5.251264 -0.242276 0.344481
O  -4.150589 1.786636 0.10571
C  -0.260342 -0.317683 0.26182
C  0.969411 0.596902 0.029958
C  2.305238 -0.13093 0.356189
C  -0.115995 -1.623904 -0.56283
C  2.434073 -1.432143 -0.486492
C  1.214125 -2.351961 -0.260179
C  -1.560175 0.461084 -0.056888
C  -2.844891 -0.318435 0.286474
C  3.474754 0.790378 0.067866
C  -4.091177 0.543857 0.226764
H  -0.280132 -0.595007 1.340457
H  0.878383 1.508351 0.652656
H  0.99484 0.926114 -1.028251
H  2.327071 -0.387428 1.431623
H  -0.158949 -1.369194 -1.643057
H  -0.963548 -2.306309 -0.358572
H  3.368012 -1.963561 -0.221244
H  2.507742 -1.154214 -1.555961
H  1.306055 -3.253025 -0.896558
H  1.207894 -2.70442 0.79199
H  -1.565598 1.414973 0.504457
H  -1.572071 0.73735 -1.130102
H  -2.99962 -1.185602 -0.380656
H  -2.785074 -0.735943 1.312761
H  4.953035 1.711511 0.987653
H  -6.049763 0.352805 0.324147
