program: Gaussian 09
title: 000277073
version: EM64L-G09RevD.01
frameworkgroup: C1[X(C13H8BrNO)]
method: RPBEPBE
basis: SDD
operation: Freq
keyword: #p
keyword: freq=noraman
keyword: PBEPBE/SDD
title: #p freq=noraman PBEPBE/SDD
converged: NO YES NO YES
title: Mulliken charges:
elementType: Br O N C C C C C C C C C C C C C H H H H H H H H
charge: 0.025322 -0.251409 -0.439988 0.289863 0.309726 0.413179 0.113689 -0.010660 -0.376560 -0.369243 -0.419433 -0.346203 -0.269253 -0.236541 -0.222110 -0.237970 0.336645 0.225594 0.223704 0.279661 0.238353 0.253183 0.232544 0.237906
chargesum: 0.00000
title: Mulliken charges with hydrogens summed into heavy atoms:
elementType: Br O N C C C C C C C C C C C C C
charge: 0.025322 -0.251409 -0.103343 0.289863 0.309726 0.413179 0.113689 -0.010660 -0.150965 -0.145540 -0.419433 -0.066542 -0.030899 -0.003997 0.031073 -0.000063
polarizability: 2.60489878e+02 9.41240392e+00 1.97530512e+02 2.13983971e-03 3.15897945e-03 5.99718261e+01
1716.lowfreq: -7.9302 -0.0004 0.0005 0.0006 3.1057 4.7126 46.9688 96.2864 128.0863
frequency: 46.9607 96.2840 128.0860 140.3353 163.2177 230.8151 237.8178 287.2054 310.9131 337.2950 423.1733 424.2888 445.6747 466.7586 496.5715 539.2226 572.3688 604.2184 622.9713 656.1671 681.5061 725.5808 734.8586 753.5509 772.1427 792.5539 794.3234 808.5851 874.3460 894.1250 904.7513 967.0942 980.7326 1003.1121 1008.5674 1040.2565 1075.3821 1090.5483 1125.2154 1156.3419 1177.9012 1208.3306 1261.1598 1277.0549 1290.2381 1323.6457 1362.1520 1390.0062 1402.1809 1432.1702 1451.8658 1477.6184 1491.3082 1552.0705 1578.3573 1607.1462 1619.6072 1631.5108 3133.8124 3146.9115 3150.5607 3160.1215 3166.5808 3172.5248 3180.3450 3477.5599
redmass: 8.1544 4.2743 13.4733 7.3715 4.5322 8.1644 4.1950 7.8202 5.4995 7.1703 3.2495 7.4191 7.7949 4.2679 8.0985 3.4229 3.8232 6.4005 6.7161 2.6159 6.7642 6.6839 1.9834 2.0136 1.2642 5.9652 1.9204 2.9965 5.0207 1.5770 1.3828 1.3545 1.3729 7.7481 1.3427 2.3685 2.3652 2.4588 2.6444 1.4042 1.0774 1.3757 1.5683 2.3532 3.3954 2.2515 2.7780 7.6775 3.2337 2.7829 2.3250 3.6356 3.1332 6.2364 6.7905 6.9141 6.6287 5.6672 1.0859 1.0880 1.0881 1.0944 1.0923 1.0997 1.0990 1.0761
irintensity: 0.9025 0.2238 0.1243 0.7803 0.5764 0.1830 2.4023 7.8161 6.3392 2.0183 2.3140 1.5765 6.8409 0.3232 0.2940 0.9918 5.7212 7.2041 20.9452 0.0042 5.7667 25.1046 0.0015 2.4154 254.6633 5.5722 0.6278 0.4004 16.5516 0.0482 0.0015 0.1117 2.4972 19.3304 0.4881 22.4256 1.8834 12.2768 32.9133 8.9664 0.5700 17.7881 1.4867 24.3155 23.8774 85.7206 37.9202 47.7024 14.2263 22.4105 10.9078 14.9276 11.6220 4.8265 23.5030 55.3275 44.1727 374.4998 3.5981 9.7725 1.8393 3.1076 7.8028 29.0147 14.0768 66.6131
temp: 298.150 k
press: 1.00000 atm
elementType: 35 8 7 6 6 6 6 6 6 6 6 6 6 6 6 6 1 1 1 1 1 1 1 1
symmnumber: 1
zpe: 457790.9 jmol-1
zpe.correction: 0.174363 hartree
zpe.thermalcorrener: 0.186439 hartree
zpe.thermalcorrenthalpy: 0.187383 hartree
zpe.thermalcorrgfe: 0.134982 hartree
zpe.sumelectzpe: -642.585138 hartree
zpe.sumelectthermal: -642.573062 hartree
zpe.sumelectthermalent: -642.572118 hartree
zpe.sumelectthermalfe: -642.624519 hartree
dipole: -0.8473 4.6798 0.0002
dipole: 4.7559
quadrupole: -85.4324 -100.7651 -106.4291
quadrupole: -4.5774 0.0002 -0.0002
quadrupole: 12.1098 -3.2229 -8.8869 -4.5774 0.0002 -0.0002
hfenergy: -642.759501 hartree
pointgroup: C01 [X(C13H8Br1N1O1)]
dipole: -0.1298298 -1.8665947 0.0000594 debye
dipolederiv: -0.3449264 0.2427099 -0.0000061 0.35129 -0.4086301 0.0000127 -0.0000116 0.0000113 -0.0135185 -0.6665802 -0.2078001 -0.0000151 -0.4259132 -1.2624696 -0.0000339 0.000071 0.0001064 -0.3654781 -1.033403 -0.6442707 0.0000359 -0.178948 -0.6452266 0.0000167 -0.0000223 -0.0000003 -0.2762953 -0.0158176 0.0417137 -0.0000075 -0.277742 -0.0921642 -0.0000019 0.0000007 0.0000132 0.0086484 0.4380766 0.0592299 -0.0000036 -0.083585 0.0331935 0.0000123 0.0000071 -0.0000147 0.0217679 -0.0537001 0.4324798 -0.0000164 0.6508339 0.4121784 -0.0000052 -0.0000248 0.0000013 0.12019 -0.0930557 0.2064171 -0.0000008 0.0598365 -0.4133595 0.0000022 0.0000194 -0.0000108 0.0049992 1.3667841 0.4049356 0. 0.2806649 1.4690699 0.0000192 -0.0000749 -0.0000699 0.1977447 0.1102539 -0.0066274 0.000004 0.1393933 0.0770224 -0.0000077 0.0000045 -0.000004 -0.132467 -0.3449927 0.0678983 0.0000041 0.1407979 0.0754077 0.0000017 0.0000099 0.0000025 -0.1481041 0.5486392 -0.6661337 0.0000205 -0.7258252 0.6342193 -0.0000256 0.0000263 -0.0000406 -0.1580511 -0.1044969 -0.0910598 -0.0000034 0.1869266 0.0880623 0.0000014 0.0000068 -0.0000019 -0.102807 -0.2310446 -0.0475824 0.0000034 0.1631437 0.022612 -0.0000081 -0.000004 -0.0000078 -0.17493 0.1334815 -0.045784 -0.0000103 -0.0512764 0.1459518 0.000006 -0.0000127 0.0000055 -0.1309966 -0.1465509 0.1763212 -0.0000015 -0.1010475 -0.1683263 0.0000038 0.0000043 0.000003 -0.0800655 0.0948545 0.0663825 -0.0000115 -0.0665627 -0.1760333 -0.000002 -0.0000137 -0.0000052 -0.1631522 0.2601099 -0.0135515 -0.0000056 -0.0326633 0.1892328 0.0000009 0.0000017 0.0000029 0.3014385 0.0530011 0.1186195 -0.0000049 0.0798312 -0.0215201 0.0000054 -0.0000032 0.0000024 0.1445936 0.0779122 -0.1021764 0.0000013 -0.0541087 -0.0609189 -0.0000018 -0.0000069 -0.000001 0.1457667 0.1073493 -0.0095842 0.0000004 -0.0847699 0.0187655 -0.0000007 0.0000039 -0.000002 0.1549503 0.0211545 -0.0550238 0.0000022 -0.0705586 -0.0756441 0.0000082 0.0000007 0.000008 0.1694261 -0.0527617 -0.0090451 -0.0000005 0.0008323 0.1113264 0.000002 -0.0000035 0.0000044 0.1602964 -0.0005103 0.0956261 0.0000059 0.121011 -0.0414392 -0.0000063 0.0000095 -0.0000068 0.154796 -0.1237768 -0.0136943 0.0000095 -0.0215608 0.0886898 0.0000007 0.0000117 0.000004 0.1612476 unknown
polarizability: 261.1682618|-6.7396233|196.8521282|-0.0028512|-0.0025355|59.9718261 unknown
InChI: InChI=1S/C13H8BrNO/c14-11-7-3-6-9-8-4-1-2-5-10(8)13(16)15-12(9)11/h1-7,15H
charge 0 multiplicity 1
24 atoms
Br -3.833757 1.883591 -0.000031
O  1.143359 3.048464 -0.000082
N  -0.687825 1.625567 0.000007
C  -0.509239 -0.816286 0.000065
C  0.957973 -0.669661 0.000028
C  -1.308917 0.375408 0.000032
C  1.540395 0.63816 0.000017
C  0.698383 1.861045 0.000078
C  -1.170379 -2.073705 0.000103
C  1.840618 -1.788792 -0.000017
C  -2.727577 0.256932 0.000026
C  2.948518 0.808425 -0.000042
C  -2.571822 -2.167089 0.000105
C  3.234683 -1.612458 -0.00007
C  -3.364203 -0.991223 0.000064
C  3.798527 -0.308842 -0.000081
H  -1.277841 2.466049 -0.000036
H  -0.581134 -2.994834 0.000129
H  1.439693 -2.806711 -0.000021
H  3.336787 1.832054 -0.000043
H  -3.06223 -3.145047 0.000134
H  -4.455991 -1.052489 0.00006
H  3.89041 -2.490182 -0.000107
H  4.88567 -0.178977 -0.00012
