program: Gaussian 09
title: 000277069
version: EM64L-G09RevD.01
frameworkgroup: C1[X(C13H8BrNO)]
method: RPBEPBE
basis: SDD
operation: Freq
keyword: #p
keyword: freq=noraman
keyword: PBEPBE/SDD
title: #p freq=noraman PBEPBE/SDD
converged: NO YES NO NO
title: Mulliken charges:
elementType: Br O N C C C C C C C C C C C C C H H H H H H H H
charge: 0.027762 -0.409933 -0.013985 0.240087 0.209770 0.268905 0.261857 -0.231269 -0.420797 -0.398219 -0.353557 -0.401141 -0.229751 -0.216761 -0.231041 -0.236325 0.252650 0.247418 0.301730 0.236505 0.250139 0.230864 0.232763 0.382328
chargesum: 0.00000
title: Mulliken charges with hydrogens summed into heavy atoms:
elementType: Br O N C C C C C C C C C C C C C
charge: 0.027762 -0.027605 -0.013985 0.240087 0.209770 0.268905 0.261857 -0.231269 -0.168147 -0.150801 -0.353557 -0.099412 0.006755 0.033378 -0.000176 -0.003562
polarizability: 2.56652373e+02 -1.73825913e+00 2.17820344e+02 3.78794690e-02 6.57086550e-03 6.01566055e+01
1716.lowfreq: -5.8271 -0.0006 -0.0005 -0.0002 5.7973 7.5045 45.7142 108.6056 117.9373
frequency: 45.6869 108.5988 117.9367 123.0964 176.5113 198.2922 222.5786 234.4913 292.9026 322.5608 376.8645 401.3142 427.2392 441.4203 496.6274 521.1846 524.8916 555.9570 581.0784 625.4699 649.4313 671.4892 736.0903 748.4914 766.4228 785.5562 794.1088 812.8392 880.6550 894.7750 908.6459 948.3709 965.6669 976.6021 996.6557 1007.0183 1033.1642 1060.4418 1084.9534 1133.5448 1150.7028 1171.7927 1192.5704 1219.7559 1277.1064 1300.0457 1314.1711 1371.7507 1389.1835 1423.1169 1444.2594 1458.5576 1470.9473 1566.8537 1572.3125 1591.8388 1613.6566 1618.4162 3129.1405 3139.0455 3143.1890 3157.0910 3161.5022 3176.6844 3203.0279 3556.6364
redmass: 8.1297 4.1787 12.7219 5.1387 5.3556 6.0251 8.3719 5.6152 6.8824 5.6892 8.4714 3.0982 6.9386 2.6291 1.6824 2.8144 6.4521 6.5161 3.9474 7.3117 3.9776 6.9683 6.1994 1.6743 1.6146 6.6749 2.5472 2.6869 9.4013 1.4029 1.4820 7.9423 1.4223 1.3532 1.3411 5.5851 2.4452 2.1544 2.4712 1.9287 1.7537 1.1214 1.5260 1.9038 2.2665 1.6561 1.5407 3.6785 4.3564 2.5223 3.2337 2.9221 3.9885 6.8830 7.6329 7.0399 7.8628 7.4327 1.0860 1.0870 1.0916 1.0937 1.0982 1.0976 1.0949 1.0675
irintensity: 0.0027 0.6621 0.5334 4.8802 0.0453 0.0080 0.2240 2.8477 2.2347 5.2188 5.1732 15.4307 1.4921 7.8284 71.2551 29.4972 1.0618 0.8580 9.1052 8.3498 24.2318 25.4741 5.5596 3.7082 116.9077 31.7030 43.5936 0.0231 156.8350 0.1559 0.8813 36.1879 5.7383 1.4431 0.5683 8.6289 13.4681 10.2118 24.4184 24.5732 21.0427 1.2654 1.3859 9.9962 16.2446 20.4033 51.6796 7.8992 2.8122 43.4100 32.8016 4.7188 1.8801 60.9517 0.6159 1.1041 21.4617 15.0554 1.7600 6.0852 10.9012 10.3172 35.6716 12.3639 5.0884 89.2744
temp: 298.150 k
press: 1.00000 atm
elementType: 35 8 7 6 6 6 6 6 6 6 6 6 6 6 6 6 1 1 1 1 1 1 1 1
symmnumber: 1
zpe: 451368.9 jmol-1
zpe.correction: 0.171917 hartree
zpe.thermalcorrener: 0.184481 hartree
zpe.thermalcorrenthalpy: 0.185426 hartree
zpe.thermalcorrgfe: 0.132105 hartree
zpe.sumelectzpe: -642.498797 hartree
zpe.sumelectthermal: -642.486233 hartree
zpe.sumelectthermalent: -642.485289 hartree
zpe.sumelectthermalfe: -642.538609 hartree
dipole: 1.8800 0.9833 0.0003
dipole: 2.1216
quadrupole: -90.8807 -78.8924 -106.8824
quadrupole: -0.5169 0.0023 0.0006
quadrupole: 1.3378 13.3261 -14.6639 -0.5169 0.0023 0.0006
hfenergy: -642.6707142 hartree
pointgroup: C01 [X(C13H8Br1N1O1)]
dipole: -0.5777026 -0.6024925 0.0001167 debye
dipolederiv: -0.3055327 -0.269217 0.0000463 -0.4185093 -0.4376818 0.0001098 0.0000981 0.0000871 -0.0187039 -0.5859569 1.1630357 -0.0000509 0.3970264 -0.8251305 -0.0000274 0.0004414 0.0001912 -0.3505382 0.1506292 -0.9932324 0.0000289 -0.2409146 0.5354142 -0.0000485 -0.0000971 0.0000299 -0.1441447 0.2828568 -0.2633896 0.0000047 0.0998211 0.067405 -0.0000136 0.0006026 0.0004797 -0.0073967 0.2004262 0.2089805 -0.000059 -0.0709957 -0.0603186 0.0000403 0.000018 0.0000055 0.0049895 -0.4341891 -0.2253397 0.0000915 -0.4319823 -0.1261202 0.0000906 -0.0012142 -0.0008731 0.0751914 -0.3249988 0.055592 0.0000616 0.103208 -0.0120131 -0.000004 0.0001353 0.0000618 0.079422 0.5709648 0.072207 -0.0001148 0.0223093 -0.1262308 0.0000154 0.0003489 0.000294 -0.0010331 -0.244814 0.1579086 -0.0000043 0.1021366 -0.0080057 -0.0000405 0.0000538 0.0000047 -0.1601889 -0.223445 -0.181124 0.0000495 -0.0157517 0.0950817 -0.0000269 -0.0001305 -0.0000925 -0.1610301 0.5385686 0.4828998 -0.0000877 0.8168508 0.8339895 -0.0001826 -0.0001719 -0.0001495 -0.1197518 0.0289 -0.0204152 -0.0000127 -0.1056409 0.0574469 -0.0000178 -0.0001164 -0.0000815 -0.1396091 0.1547453 -0.0373767 -0.0000411 -0.063155 0.0338574 -0.0000005 0.0000668 0.0000634 -0.1361567 -0.1298487 -0.1217947 0.000007 -0.1401998 -0.2769479 0.0000055 0.0001129 0.0000972 -0.1199747 0.0835409 0.1299785 -0.0000531 0.1068718 -0.0253802 -0.0000245 0.0000362 0.000026 -0.1407222 0.040601 -0.0360083 -0.0000298 -0.076107 -0.0305691 0.0000275 -0.0001947 -0.0001259 -0.1765726 0.0585218 -0.1018202 0.0000277 -0.0583015 -0.0507385 0.0000314 -0.000077 -0.0000387 0.1580194 0.0833232 0.0789863 0.000006 0.027783 -0.0842594 0.0000089 0.0000039 0.0000039 0.1555055 0.1073264 0.0029053 0.0000108 0.0598704 0.0016278 0.000006 0.0001112 0.0000859 0.1730307 -0.0041566 0.0851876 0.0000118 0.093823 -0.0565759 0.0000068 0.0000452 0.0000253 0.1609586 -0.0624681 -0.0043038 0.00001 -0.025505 0.0991252 0.0000096 -0.0000051 -0.0000202 0.1622741 -0.0487215 -0.1074481 0.0000192 -0.1228745 -0.0106672 0.0000119 0.000072 0.0000515 0.1588275 -0.1264172 0.0359832 0.0000382 0.0554746 0.0738639 0.0000029 0.000027 -0.0000027 0.1623874 0.1901444 -0.1121948 0.0000404 -0.1152379 0.3328274 0.0000198 -0.0001663 -0.0001229 0.3852166 unknown
polarizability: 253.7554037|10.350087|220.7173127|-0.0338075|-0.0183053|60.1566055 unknown
InChI: InChI=1S/C13H8BrNO/c14-11-7-3-6-9-8-4-1-2-5-10(8)13(15-16)12(9)11/h1-7,16H
charge 0 multiplicity 1
24 atoms
Br 3.397427 2.076155 -0.000611
O  -1.056965 3.274168 -0.000128
N  0.186626 2.517016 -0.000234
C  0.497451 -1.09144 -0.000021
C  -0.972823 -0.958295 0.000158
C  1.073354 0.227679 -0.000186
C  -1.31169 0.432733 0.000105
C  -0.046938 1.212093 -0.000111
C  1.299415 -2.245223 -0.000044
C  -1.97728 -1.943463 0.000353
C  2.476716 0.347854 -0.000375
C  -2.662578 0.841261 0.000248
C  2.706125 -2.094643 -0.000237
C  3.294396 -0.80919 -0.000401
C  -3.332602 -1.531498 0.000495
C  -3.669509 -0.155679 0.000443
H  0.848716 -3.242613 0.000083
H  -1.724609 -3.009274 0.000395
H  -2.919461 1.901164 0.000208
H  3.355537 -2.976315 -0.000261
H  4.382611 -0.702171 -0.000549
H  -4.129201 -2.283628 0.000647
H  -4.723772 0.141872 0.000555
H  -0.729546 4.210639 -0.000231
