program: Gaussian 09
title: 000277068
version: EM64L-G09RevD.01
frameworkgroup: C1[X(C13H7BrO)]
method: RPBEPBE
basis: SDD
operation: Freq
keyword: #p
keyword: freq=noraman
keyword: PBEPBE/SDD
title: #p freq=noraman PBEPBE/SDD
converged: NO YES NO NO
title: Mulliken charges:
elementType: Br O C C C C C C C C C C C C C H H H H H H H
charge: 0.052083 -0.135406 0.310444 0.273592 0.253795 0.232052 -0.262482 -0.416378 -0.386362 -0.364351 -0.419221 -0.215444 -0.222921 -0.219231 -0.228071 0.252200 0.246720 0.282866 0.238571 0.256203 0.233102 0.238238
chargesum: 0.00000
title: Mulliken charges with hydrogens summed into heavy atoms:
elementType: Br O C C C C C C C C C C C C C
charge: 0.052083 -0.135406 0.310444 0.273592 0.253795 0.232052 -0.262482 -0.164177 -0.139642 -0.364351 -0.136355 0.023127 0.033282 0.013871 0.010167
polarizability: 2.52913939e+02 -6.95839156e+00 1.84662919e+02 9.90192107e-03 8.77250638e-03 5.64926513e+01
1716.lowfreq: -6.4007 -0.0008 -0.0005 0.0005 7.7317 10.2831 56.7956 107.9917 116.6574
frequency: 56.7945 107.9872 116.6502 145.0231 191.2328 221.5370 271.6394 272.8207 313.2348 413.7126 420.9174 441.3206 496.4911 519.1374 556.7554 582.9287 629.9449 648.1467 669.4185 742.1538 747.2386 768.7977 782.7790 806.2938 840.4747 898.4834 900.2717 911.8101 969.5434 983.9105 999.0074 1005.0856 1029.6689 1050.9444 1081.7498 1126.2615 1147.8390 1169.3619 1185.4429 1201.0036 1263.2271 1293.1600 1366.6837 1383.5607 1427.3310 1443.2441 1451.5165 1472.1313 1571.2526 1593.3559 1604.2815 1613.8146 1637.7720 3130.6203 3138.9289 3143.6512 3154.1070 3156.7808 3169.2403 3175.4998
redmass: 9.8711 4.2713 11.8486 5.9794 4.6613 6.6727 12.3054 4.9628 7.1911 3.3914 7.2414 4.0131 4.0003 6.1892 8.6465 4.0503 7.3424 7.0357 4.0293 6.5963 1.7312 1.4623 6.8009 1.9292 4.1364 7.4504 1.4699 1.4751 1.4461 1.3622 1.3562 4.2418 2.8020 2.4261 2.3938 2.3395 1.9073 1.1941 1.7607 1.5369 2.1826 1.7144 9.2157 2.5197 2.3185 3.5471 2.5564 4.3705 7.5634 7.6960 7.1443 7.7878 10.9499 1.0864 1.0871 1.0901 1.0946 1.0936 1.1003 1.0977
irintensity: 2.0593 1.9453 0.3510 0.0431 0.2454 0.1529 4.7799 0.1773 1.0783 0.0458 1.1576 4.9887 0.6563 4.4894 3.0378 5.7812 8.2914 15.5230 15.0173 10.9625 2.1707 126.8460 32.3389 19.5397 3.0873 38.0885 0.0295 0.8696 3.6728 1.1360 0.0368 10.6652 19.1431 5.7918 25.0985 22.3230 7.6287 7.7409 22.0249 36.2467 29.4980 9.9358 4.4367 1.7502 69.2886 10.0124 10.9459 6.7234 79.9657 137.4588 2.6564 86.6661 82.4732 2.3429 5.0378 4.4515 8.7339 14.7497 30.3590 10.9993
temp: 298.150 k
press: 1.00000 atm
elementType: 35 8 6 6 6 6 6 6 6 6 6 6 6 6 6 1 1 1 1 1 1 1
symmnumber: 1
zpe: 410402.7 jmol-1
zpe.correction: 0.156314 hartree
zpe.thermalcorrener: 0.167603 hartree
zpe.thermalcorrenthalpy: 0.168548 hartree
zpe.thermalcorrgfe: 0.117844 hartree
zpe.sumelectzpe: -587.275870 hartree
zpe.sumelectthermal: -587.264581 hartree
zpe.sumelectthermalent: -587.263637 hartree
zpe.sumelectthermalfe: -587.314341 hartree
dipole: 3.0453 4.2364 0.0008
dipole: 5.2174
quadrupole: -78.0859 -87.1564 -99.3917
quadrupole: -4.5733 0.0009 -0.0003
quadrupole: 10.1254 1.0549 -11.1804 -4.5733 0.0009 -0.0003
hfenergy: -587.4321846 hartree
pointgroup: C01 [X(C13H7Br1O1)]
dipole: 0.7063446 1.9273227 0.0003053 debye
dipolederiv: -0.3350663 -0.2924121 -0.0000326 -0.4921381 -0.4132225 -0.0000222 0.0002075 0.0002332 -0.0014753 -0.5087541 -0.0538109 -0.0000127 0.0607308 -0.9132269 -0.0000579 0.0000111 -0.0001184 -0.282845 0.2828379 -0.1636522 0.0000028 -0.0738492 0.1688333 0.0000179 0.0001284 0.0001832 0.0122281 0.228183 0.0905955 0.0000136 -0.0356528 -0.0019327 0.0000072 -0.0000302 -0.0000663 -0.0034542 -0.9488179 0.112314 -0.0000096 0.0735869 -0.4924508 -0.0000526 -0.0001699 -0.0001628 0.0598155 -0.6794862 -0.1876968 -0.0000545 -0.0384857 -0.188648 -0.0000404 0.0000612 0.0000377 0.0332834 1.4161609 0.0974546 0.0000593 -0.2504712 1.0933245 0.000109 -0.0000026 0.0001138 0.1237971 -0.3656722 0.1593392 0.0000053 0.2047714 -0.0245148 0.0000155 -0.0000156 -0.0000113 -0.1589579 -0.3389981 -0.099369 -0.0000091 0.0141431 0.1197479 0.0000196 -0.0000175 0.0000047 -0.1462368 0.7880187 0.4002279 0.0000467 0.927095 0.9045648 0.0000674 -0.0001438 -0.0001668 -0.1016065 0.0830733 0.0471308 0.0000145 -0.1515394 0.146714 0.0000094 0.0000095 0.0000332 -0.1153579 0.2601056 -0.0044327 0.0000085 -0.0520639 0.1330896 0.0000132 -0.0000269 -0.000029 -0.1146311 -0.1117494 -0.12881 -0.0000097 -0.2025765 -0.4167521 -0.0000175 0.0000295 0.0000228 -0.1198756 0.1632416 0.0949791 0.0000158 0.073 0.0182129 0.0000157 0.000045 0.0000508 -0.1289143 0.0455751 -0.0648425 0.0000079 -0.0797824 -0.1077403 0.0000036 0.0000066 0.0000071 -0.1705105 0.0453799 -0.1039563 -0.0000108 -0.065036 -0.0343844 -0.000016 0.0000158 0.0000009 0.1583075 0.0905698 0.0575267 0.0000002 0.0073915 -0.0858513 -0.0000184 -0.0000333 -0.0000378 0.1544906 0.0998083 -0.0080264 -0.0000043 0.0480266 -0.02901 -0.0000129 0.0000163 0.0000033 0.1600791 0.0160548 0.0749198 0.0000023 0.0873644 -0.0622181 -0.000015 -0.0000242 -0.0000355 0.1570574 -0.0594331 0.0083439 -0.0000098 -0.0127093 0.1001207 -0.0000051 -0.0000048 -0.0000014 0.1632879 -0.063116 -0.094201 -0.0000166 -0.1112175 0.0178749 -0.0000152 -0.0000263 -0.0000274 0.1560587 -0.1079156 0.0583782 -0.0000072 0.0694121 0.0674694 -0.0000053 -0.0000357 -0.0000337 0.1654596 unknown
polarizability: 251.5898095|11.7063706|185.9870488|0.0071814|0.01111|56.4926513 unknown
InChI: InChI=1S/C13H7BrO/c14-11-7-3-6-9-8-4-1-2-5-10(8)13(15)12(9)11/h1-7H
charge 0 multiplicity 1
22 atoms
Br -3.472251 -2.029388 -0.000131
O  -0.235455 -2.688313 -0.000302
C  -0.3748 0.923798 0.000186
C  1.088566 0.661882 0.000236
C  -1.064176 -0.333445 0.000036
C  1.296472 -0.746323 0.000111
C  -0.03608 -1.444982 0.000021
C  -1.08154 2.136406 0.000273
C  2.18819 1.537812 0.000358
C  -2.466545 -0.354602 -0.000005
C  2.583957 -1.303892 0.000117
C  -2.500657 2.092545 0.000212
C  -3.195857 0.862612 0.000076
C  3.49529 0.980779 0.000368
C  3.695153 -0.421793 0.000252
H  -0.560144 3.098944 0.000375
H  2.054612 2.625089 0.000435
H  2.715843 -2.390709 0.000045
H  -3.075055 3.025177 0.000267
H  -4.289381 0.843838 0.000041
H  4.364379 1.648108 0.000455
H  4.713782 -0.823843 0.000273
