program: Gaussian 09
title: 000025819
version: EM64L-G09RevD.01
frameworkgroup: C1[X(C24H21N3S3)]
method: RPBEPBE
basis: SDD
operation: Freq
keyword: #p
keyword: freq=noraman
keyword: PBEPBE/SDD
title: #p freq=noraman PBEPBE/SDD
converged: YES YES NO NO
title: Mulliken charges:
elementType: S S S N N N C C C C C C C C C C C C C C C C C C C C C C C C H H H H H H H H H H H H H H H H H H H H H
charge: 0.310422 0.301705 0.297119 0.098226 0.055321 0.121736 0.449344 0.457053 0.447589 -0.194654 -0.200201 -0.189300 -0.371299 -0.407286 -0.384985 -0.374366 -0.332548 -0.354525 -0.211966 -0.224162 -0.167447 -0.199668 -0.186790 -0.242082 -0.803902 -0.827007 -0.811195 -0.362150 -0.340180 -0.340762 0.233217 0.235072 0.230889 0.233151 0.226111 0.233477 0.251524 0.253788 0.255326 0.249863 0.250870 0.252883 0.226054 0.225913 0.240428 0.241662 0.237390 0.226415 0.222766 0.233070 0.228091
chargesum: 0.00000
title: Mulliken charges with hydrogens summed into heavy atoms:
elementType: S S S N N N C C C C C C C C C C C C C C C C C C C C C C C C
charge: 0.310422 0.301705 0.297119 0.098226 0.055321 0.121736 0.449344 0.457053 0.447589 -0.194654 -0.200201 -0.189300 -0.138081 -0.172214 -0.154096 -0.141216 -0.106437 -0.121048 0.039559 0.029625 0.087879 0.050196 0.064080 0.010801 -0.111507 -0.121539 -0.127268 -0.362150 -0.340180 -0.340762
polarizability: 5.11994406e+02 2.25467531e-01 3.15421054e+02 -1.36004425e+01 -1.75115179e+01 2.30481596e+02
1716.lowfreq: -12.2014 -3.7928 0.0013 0.0015 0.0018 2.2277 6.6587 11.1080 14.3815
frequency: -11.7108 11.0018 14.3760 16.9756 18.5380 25.2058 30.9240 33.7282 45.8722 58.3487 61.2221 85.5954 100.3262 106.3918 116.7467 131.4024 141.4299 146.5553 148.3557 187.9436 229.8352 235.5512 238.9874 283.1912 295.3762 302.8163 323.4677 353.2342 357.9963 358.2999 393.3790 396.3774 398.2262 405.5574 406.1615 406.7056 428.0371 447.5270 471.6680 508.5153 512.3111 540.0917 607.7478 609.4405 610.1430 611.3059 614.3809 630.6667 631.0266 631.5125 708.7975 711.8393 712.5763 771.2043 776.6688 786.2761 787.9111 788.5660 789.2079 819.2667 822.0696 822.5979 841.9368 845.0197 845.7914 887.1446 952.6604 955.4158 956.3659 972.1687 975.2717 975.3110 984.2340 986.0443 986.1777 1001.4229 1002.6411 1003.9806 1045.7315 1047.2906 1049.9279 1075.7566 1077.4206 1079.2466 1116.6228 1116.8092 1119.3219 1178.4264 1182.7424 1186.0018 1189.9330 1191.8036 1195.4590 1219.7088 1220.0804 1220.3098 1234.8196 1295.6900 1296.0669 1298.0851 1366.6207 1367.1454 1367.3443 1392.9457 1393.5882 1393.7147 1395.7055 1396.0733 1398.5961 1400.1053 1404.5168 1468.6798 1470.1060 1471.3725 1473.0623 1473.6584 1478.8477 1482.0540 1482.7434 1482.8179 1581.3602 1581.6503 1582.9278 1606.1109 1606.2673 1606.7837 2972.5738 2977.3725 2978.2386 3052.7286 3056.1965 3059.2199 3083.4109 3085.0396 3087.8157 3123.7100 3125.1429 3126.4751 3127.4535 3128.4569 3130.2062 3155.2868 3157.1340 3157.4224 3162.1854 3164.7492 3171.1981
redmass: 1.1307 4.0377 3.3061 3.7234 6.0230 4.7490 7.5992 3.9909 5.3667 1.6419 1.7389 1.0478 5.2322 4.9794 8.8577 5.0589 5.6254 10.9538 12.5875 6.3501 5.5589 5.3772 5.4099 4.7525 4.8175 5.2249 8.2169 3.0172 2.8406 2.8477 11.0983 8.0132 7.0851 2.9922 2.8608 2.9247 11.1108 7.6724 3.5873 2.9904 3.3031 5.1993 12.0199 5.7582 5.7792 12.2476 5.9403 6.9773 6.9727 6.9807 3.2896 3.2881 3.3019 9.3426 11.4714 12.3393 5.0657 5.1696 5.3107 1.3906 1.4005 1.4216 1.2513 1.2494 1.2473 13.8619 1.3104 1.3159 1.3168 1.3900 1.3854 1.3854 1.4182 1.4038 1.4619 4.3802 4.0426 3.9403 1.5666 1.5782 1.5584 2.8723 2.8521 2.8171 1.3073 1.3091 1.3130 6.4642 3.6739 1.5144 1.1997 1.4572 3.0372 2.9763 3.0530 2.9982 11.2259 1.2741 1.2718 1.2718 4.7800 4.9206 5.0164 2.5389 3.2573 2.8857 1.6170 1.2409 3.8217 1.4855 10.7606 1.0691 1.0900 1.0511 1.0894 1.0553 1.0995 2.3803 2.4769 2.4982 6.3514 6.3215 6.4377 6.2862 6.2864 6.2433 1.0388 1.0386 1.0372 1.0949 1.0970 1.0950 1.0995 1.0989 1.0999 1.0888 1.0893 1.0890 1.0891 1.0890 1.0897 1.0959 1.0958 1.0957 1.0968 1.0962 1.0957
irintensity: 0.4235 0.1955 0.2435 0.1624 0.4988 0.5195 0.0136 0.2811 0.6742 0.0669 0.3494 0.8724 0.4688 0.4057 0.0780 1.6498 0.6070 0.1639 0.2502 1.1125 0.0837 0.0856 0.0154 0.0349 0.1827 0.6802 1.8468 0.5211 0.1783 1.0832 1.0560 2.3594 10.0592 0.1655 0.0572 0.3809 0.8316 4.3962 27.1545 1.4315 52.4410 9.9833 0.0964 0.2260 3.7890 0.8558 4.1666 0.0009 0.0141 0.0435 4.6436 3.5164 2.0216 56.5789 197.8895 1.4770 4.1903 5.3456 2.1638 36.8992 63.4606 98.5403 0.2436 1.1077 0.3086 1.0531 0.8672 0.4757 1.0885 1.7501 0.4300 0.4306 1.2513 0.1802 0.3435 57.9540 6.7372 33.2339 19.8807 14.3937 5.6087 12.7880 6.4556 6.6902 10.9229 7.1104 10.0347 98.6610 103.2019 254.5139 18.4269 37.3357 229.5744 0.2060 1.6899 1.6659 19.4976 2.0005 0.8163 2.4333 7.7215 2.5201 0.2036 95.3885 6.7654 19.9458 25.0181 28.4209 468.7812 165.2680 1321.0789 7.0568 13.4864 27.0522 25.3214 12.4586 1.4414 5.3441 32.5586 35.9154 0.2647 0.2227 0.1111 0.0669 6.0279 5.2607 36.6716 34.2252 33.4156 29.1543 17.1008 24.7711 22.3108 14.0554 17.2191 16.6758 12.6293 12.4080 17.3452 20.7841 15.4482 10.5877 9.9551 16.2714 0.8376 1.6469 2.9286
temp: 298.150 k
press: 1.00000 atm
elementType: 16 16 16 7 7 7 6 6 6 6 6 6 6 6 6 6 6 6 6 6 6 6 6 6 6 6 6 6 6 6 1 1 1 1 1 1 1 1 1 1 1 1 1 1 1 1 1 1 1 1 1
symmnumber: 1
zpe: 1005061.2 jmol-1
zpe.correction: 0.382808 hartree
zpe.thermalcorrener: 0.411634 hartree
zpe.thermalcorrenthalpy: 0.412578 hartree
zpe.thermalcorrgfe: 0.316200 hartree
zpe.sumelectzpe: -2283.482148 hartree
zpe.sumelectthermal: -2283.453321 hartree
zpe.sumelectthermalent: -2283.452377 hartree
zpe.sumelectthermalfe: -2283.548755 hartree
dipole: -3.1147 4.2320 0.5876
dipole: 5.2874
quadrupole: -152.5900 -204.2174 -184.3581
quadrupole: 5.1583 -3.4728 -8.2188
quadrupole: 27.7985 -23.8289 -3.9696 5.1583 -3.4728 -8.2188
hfenergy: -2283.8649551 hartree
pointgroup: C01 [X(C24H21N3S3)]
dipole: 1.1139643 -1.73562 0.2720925 debye
polarizability: 511.3807691|-12.3081401|317.1479556|12.7735163|14.1699877|229.3683318 unknown
InChI: InChI=1S/C24H21N3S3/c1-16-4-10-19(11-5-16)28-22-25-23(29-20-12-6-17(2)7-13-20)27-24(26-22)30-21-14-8-18(3)9-15-21/h4-15H,1-3H3
charge 0 multiplicity 1
51 atoms
S  -3.820554 2.490509 -0.574027
S  -0.851818 -2.025432 -0.08514
S  1.471433 2.978986 -0.844143
N  -2.151692 0.292131 -0.336337
N  -1.137219 2.464217 -0.678881
N  0.266987 0.495242 -0.458722
C  -6.939767 -0.96711 -0.047966
C  3.621164 -3.380538 -0.368126
C  5.454361 0.603111 -0.207688
C  -5.008012 1.09147 -0.36286
C  0.936947 -2.460573 -0.217287
C  2.97634 1.948033 -0.565481
C  -6.564548 -0.512434 -1.338721
C  2.712414 -3.617631 -1.429352
C  4.551851 0.21284 -1.230502
C  -6.331266 -0.360249 1.081668
C  3.157372 -2.663117 0.767111
C  5.084345 1.680715 0.63802
C  -5.60366 0.509912 -1.501884
C  1.375365 -3.160908 -1.360705
C  3.32283 0.881174 -1.420763
C  -5.371381 0.664314 0.931769
C  1.82521 -2.209815 0.851621
C  3.851626 2.348354 0.46927
C  -7.948232 -2.090011 0.119534
C  5.052225 -3.884444 -0.432374
C  6.776177 -0.118495 -0.008635
C  -2.213501 1.638136 -0.522629
C  -0.884708 -0.219802 -0.322374
C  0.072563 1.835523 -0.628907
H  -7.026674 -0.961991 -2.225745
H  3.046984 -4.167632 -2.316965
H  4.81248 -0.619796 -1.894413
H  -6.610694 -0.691609 2.088922
H  3.846387 -2.458578 1.595519
H  5.764478 2.003302 1.435762
H  -5.320242 0.851609 -2.502474
H  0.680873 -3.351288 -2.185358
H  2.641361 0.569253 -2.216958
H  -4.909355 1.125609 1.81024
H  1.480214 -1.661902 1.733545
H  3.573836 3.175888 1.130302
H  -8.504196 -1.998317 1.068996
H  -8.680013 -2.105181 -0.707063
H  -7.442289 -3.07505 0.128785
H  5.774563 -3.065148 -0.259052
H  5.240965 -4.651134 0.342895
H  5.280229 -4.337752 -1.412304
H  7.036225 -0.737711 -0.884748
H  7.604084 0.593361 0.161398
H  6.737936 -0.785837 0.874827
