program: Gaussian 09
title: 000277053
version: EM64L-G09RevD.01
frameworkgroup: C1[X(C14H6ClNO4)]
method: RPBEPBE
basis: SDD
operation: Freq
keyword: #p
keyword: freq=noraman
keyword: PBEPBE/SDD
title: #p freq=noraman PBEPBE/SDD
converged: YES YES NO NO
title: Mulliken charges:
elementType: Cl O O O O N C C C C C C C C C C C C C C H H H H H H
charge: -0.056300 -0.117914 -0.080175 -0.201553 -0.191206 0.021863 0.304362 0.292552 0.017827 0.271715 -0.252451 0.358950 -0.359620 -0.555330 -0.400448 0.410992 -0.374383 -0.369292 -0.201880 -0.181013 0.258905 0.333799 0.258611 0.294954 0.269015 0.248017
chargesum: 0.00000
title: Mulliken charges with hydrogens summed into heavy atoms:
elementType: Cl O O O O N C C C C C C C C C C C C C C
charge: -0.056300 -0.117914 -0.080175 -0.201553 -0.191206 0.021863 0.304362 0.292552 0.017827 0.271715 -0.252451 0.358950 -0.100715 -0.221531 -0.141837 0.410992 -0.079428 -0.100278 0.046137 -0.181013
polarizability: 3.11593639e+02 1.54308567e+01 2.06653828e+02 -1.06664183e+01 6.11654555e+00 8.64641063e+01
1716.lowfreq: -1.7793 -0.0020 -0.0014 0.0008 3.3586 6.7084 29.1468 45.1408 54.1851
frequency: 29.0984 45.1304 54.1844 69.4125 87.9689 134.5429 151.8449 158.3735 170.7826 228.8387 260.6563 280.1520 303.0924 315.5241 353.5242 418.9641 431.9004 442.3449 474.2227 492.9643 511.3146 545.6551 570.5745 589.7516 634.2659 648.2392 663.2271 674.1065 706.1464 735.1999 745.5107 764.1342 814.9598 822.7889 836.3887 869.0744 884.7223 929.5814 939.6939 967.0354 994.0726 996.5873 1042.0828 1061.5394 1081.6433 1125.3033 1148.5358 1176.7992 1187.2637 1207.9806 1229.9068 1252.7082 1287.7529 1360.0031 1378.9145 1391.1165 1427.8878 1442.3330 1464.2112 1475.1414 1588.6532 1599.8950 1602.8144 1614.2115 1641.5492 1721.9922 3143.9445 3153.2149 3157.4542 3174.2433 3180.0381 3183.6981
redmass: 18.0981 14.4359 10.9096 8.2977 12.7578 7.6673 7.2108 7.4717 6.2673 8.4526 6.8543 8.8619 8.4502 7.2690 8.8664 5.3028 5.9759 4.3409 7.6810 8.5413 5.6480 5.0272 6.5927 6.3062 8.2061 6.2432 7.6980 5.8941 4.6855 6.8542 7.1496 2.2730 8.0593 1.9348 5.5292 1.6115 6.5563 1.4663 5.7994 1.5448 1.3947 1.3792 3.2839 2.1642 2.2872 2.4199 2.2038 1.9338 2.0092 8.5737 2.2334 1.5744 2.3216 7.1318 5.9124 4.1132 2.6539 4.3605 3.2475 5.0020 8.2440 7.6895 7.7490 8.2163 11.5172 13.1737 1.0877 1.0909 1.0925 1.0992 1.0935 1.0951
irintensity: 0.3893 0.1381 0.1545 0.6458 0.9478 0.5237 0.5020 1.4175 4.2332 1.2786 4.6074 1.8908 4.5098 2.6997 1.2054 13.7773 6.2102 6.2321 0.8090 4.8977 16.6032 14.9676 3.7793 6.1540 4.6717 10.7790 13.6106 33.9121 7.8803 62.1533 90.7761 16.5551 3.2338 26.4990 17.7625 13.8687 71.2918 3.6322 35.6681 19.8123 1.2996 0.2786 24.1946 46.4955 4.1345 14.2862 37.5474 40.9157 42.2718 422.3983 60.0247 1.6040 0.5115 60.2489 7.8448 50.5798 13.5623 6.9462 7.5166 15.7326 59.3846 6.7099 6.1425 184.8770 91.6924 259.2400 2.4533 2.6190 5.0250 11.0020 6.9358 3.3900
temp: 298.150 k
press: 1.00000 atm
elementType: 17 8 8 8 8 7 6 6 6 6 6 6 6 6 6 6 6 6 6 6 1 1 1 1 1 1
symmnumber: 1
zpe: 438128.6 jmol-1
zpe.correction: 0.166874 hartree
zpe.thermalcorrener: 0.182789 hartree
zpe.thermalcorrenthalpy: 0.183733 hartree
zpe.thermalcorrgfe: 0.121553 hartree
zpe.sumelectzpe: -1351.370709 hartree
zpe.sumelectthermal: -1351.354794 hartree
zpe.sumelectthermalent: -1351.353850 hartree
zpe.sumelectthermalfe: -1351.416030 hartree
dipole: 1.9217 8.3503 1.0863
dipole: 8.6371
quadrupole: -149.5011 -113.1502 -122.8666
quadrupole: 4.9095 2.6202 -0.4204
quadrupole: -20.9951 15.3558 5.6394 4.9095 2.6202 -0.4204
hfenergy: -1351.537583 hartree
pointgroup: C01 [X(C14H6Cl1N1O4)]
dipole: 0.9629159 3.2584108 -0.0516444 debye
dipolederiv: -0.1959188 0.0498974 0.0587978 0.1929257 -0.4279291 0.3691687 -0.1327052 0.4217703 -0.8041014 -0.5644664 0.086985 0.0020812 0.0997653 -0.8228353 -0.0670296 0.0290397 -0.0643763 -0.2474541 -0.6736109 0.1667598 0.4702714 0.312639 -0.4001479 -0.0996324 0.2017146 0.1059675 -0.8366448 -1.0358425 0.1186074 0.0310321 0.1678082 -0.5060392 -0.0085537 0.0354743 -0.0068861 -0.2243995 -0.6603382 -0.1509674 0.0154222 -0.2994241 -0.7644927 0.005236 0.017774 0.0035716 -0.2168373 2.1022625 0.2309617 -0.0697992 0.4152512 1.1340686 -0.0070926 -0.0804694 -0.0050493 0.1891329 -0.0305651 0.0969431 -0.0092736 0.03781 0.0093573 0.0138424 0.0042743 0.0052115 0.0245179 0.660478 -0.058491 -0.0178166 0.052364 0.1002085 0.0067292 -0.0367421 -0.0071826 0.0248658 -0.4489749 -0.3054221 0.0138228 -0.3060844 -0.3004087 0.0113815 -0.070588 0.0874803 0.0018691 -0.8171249 0.0327169 0.0300092 -0.2027591 -0.2578761 -0.0025917 0.0206494 -0.0014197 0.0105735 1.3238769 -0.019569 -0.034231 -0.0226963 1.0416205 0.0968365 -0.0350117 0.0422739 0.1382167 0.1048765 0.1238025 0.0548943 0.1036796 -0.1141555 0.0174158 0.0641178 -0.0122829 -0.0715298 -0.670424 0.089584 0.018428 0.0599624 0.1614727 -0.0041591 0.0273442 -0.0026929 -0.1306915 0.4022161 0.1270572 -0.0144964 0.0110823 0.013223 0.0001921 -0.0115736 -0.0052797 -0.0616031 -0.1653713 -0.1362732 -0.0215987 -0.0403247 0.0742468 -0.0033626 0.000661 0.0076659 -0.1326326 -0.8052917 -0.2277093 0.0258516 -0.3213061 -0.1052075 0.0097215 0.0391976 0.009162 0.046842 0.2787572 -0.0577976 -0.0144945 0.3406709 0.0049331 -0.0118163 -0.0179895 0.0051828 -0.0805455 -0.0469178 0.1022008 -0.0385842 -0.0843243 -0.1360773 0.038529 0.0288406 -0.0427061 -0.1274091 0.0142833 0.0660293 0.0108852 0.2067464 0.1333808 -0.0250452 -0.0100481 -0.0142236 -0.0964519 0.8666597 -0.3585426 -0.5364825 -0.7278698 0.9642763 -0.3468006 -0.0845404 -0.5486022 1.6477892 0.083119 -0.0540377 0.0045268 -0.0237967 -0.0532168 -0.0003182 0.0046393 0.0007223 0.1503118 0.1447174 -0.000994 0.0008012 0.0082564 0.0953543 0.0000731 -0.0040947 0.0002661 0.1691093 0.0581702 0.0990069 0.0013807 0.0583869 -0.0152517 0.0004911 0.0047027 -0.0012003 0.1527593 0.0799642 0.0552793 0.0040315 0.0191243 0.1084632 -0.0014428 0.0045951 -0.0026897 0.1682223 -0.0301867 -0.0059077 0.0062694 0.0208478 0.1000707 -0.0078463 -0.0052545 0.0161088 0.1500017 0.0256524 -0.0701197 0.0082714 -0.0787348 -0.037038 0.0160744 0.0059927 0.0092086 0.156089 unknown
polarizability: 313.1586342|7.0777685|204.5245278|-11.0795954|-10.7882431|87.0284107 unknown
InChI: InChI=1S/C14H6ClNO4/c15-14(18)10-3-1-2-9-8-5-4-7(16(19)20)6-11(8)13(17)12(9)10/h1-6H
charge 0 multiplicity 1
26 atoms
Cl 3.538481 -2.147341 1.574367
O  0.725095 -2.294473 -0.18251
O  4.537282 -1.649102 -0.9144
O  -5.564378 0.241399 0.211234
O  -4.716168 -1.877191 0.164359
N  -4.581186 -0.594379 0.164487
C  0.828185 1.306123 -0.06749
C  -0.631422 1.038753 -0.002166
C  1.519111 0.057866 -0.070644
C  -0.833015 -0.374647 0.00079
C  0.505168 -1.061753 -0.077293
C  2.924525 0.011354 -0.126916
C  -1.733252 1.912356 0.050188
C  -2.109743 -0.942757 0.051271
C  1.535409 2.519835 -0.131904
C  -3.202364 -0.043254 0.106433
C  -3.035038 1.360733 0.106708
C  3.640191 1.238459 -0.229768
C  2.949701 2.471328 -0.222477
C  3.728402 -1.249746 -0.0835
H  -1.60325 2.998944 0.048091
H  -2.270739 -2.024061 0.048916
H  1.016957 3.483901 -0.125013
H  -3.924243 1.995457 0.149544
H  4.732532 1.221508 -0.295821
H  3.522059 3.40219 -0.288689
