program: Gaussian 09
title: 000277056
version: EM64L-G09RevD.01
frameworkgroup: C1[X(C14H10Br2N2O2)]
method: RPBEPBE
basis: SDD
operation: Freq
keyword: #p
keyword: freq=noraman
keyword: PBEPBE/SDD
title: #p freq=noraman PBEPBE/SDD
converged: YES YES NO NO
title: Mulliken charges:
elementType: Br Br O O N N C C C C C C C C C C C C C C H H H H H H H H H H
charge: -0.008784 0.000159 -0.300174 -0.177045 -0.672732 -0.695590 0.461539 0.302688 0.224926 0.256436 -0.344450 -0.612769 -0.602595 -0.334102 -0.645225 0.453096 0.180898 0.712239 -0.531713 -0.526299 0.292234 0.270979 0.277134 0.326742 0.347828 0.324381 0.316269 0.230823 0.242243 0.230865
chargesum: 0.00000
title: Mulliken charges with hydrogens summed into heavy atoms:
elementType: Br Br O O N N C C C C C C C C C C C C C C
charge: -0.008784 0.000159 -0.300174 -0.177045 0.001838 -0.054941 0.461539 0.302688 0.224926 0.256436 -0.344450 -0.612769 -0.310362 -0.063123 -0.368092 0.453096 0.180898 0.712239 -0.531713 0.177632
polarizability: 3.87763206e+02 -1.45957991e+01 2.66387332e+02 -3.11098266e-03 3.91417078e-03 7.83932844e+01
1716.lowfreq: -1.9715 -1.3231 0.0002 0.0004 0.0005 3.6997 29.8373 61.0944 71.2851
frequency: 29.8328 61.0838 71.2814 75.1755 99.8478 124.7252 154.8881 158.5680 162.6326 204.4369 217.9324 228.1992 241.2043 245.9591 284.2038 286.2787 313.8372 314.3952 344.1078 405.5888 418.3696 429.9009 457.1728 458.7464 465.2235 475.6971 518.2442 522.3496 544.1164 561.4965 591.1312 608.8238 671.7838 680.1113 687.1226 735.3304 762.2305 778.0989 778.6072 806.0657 839.6536 885.9380 896.9349 918.4239 948.0653 986.8808 1021.7534 1043.2061 1063.6358 1100.5479 1118.6736 1152.5931 1165.7235 1183.3521 1216.5288 1251.3341 1287.0926 1315.8259 1377.9358 1399.3440 1423.2738 1448.8027 1465.7540 1475.3231 1482.4300 1490.2282 1492.5634 1559.5407 1569.3618 1591.6685 1604.4523 1625.1115 1628.8294 1644.9292 2969.1404 3059.6654 3129.9309 3135.8526 3163.4107 3186.8499 3536.9037 3549.0193 3685.2135 3695.9351
redmass: 10.3184 5.4641 4.0634 22.2215 9.7658 4.8986 5.2029 12.4879 3.9302 4.9289 14.9467 1.3838 4.9642 7.2585 3.4689 8.1889 5.8169 5.6736 3.8584 1.9089 1.7945 2.7776 1.2132 4.2724 5.1567 1.3709 3.2509 6.3929 1.1811 5.6530 6.5259 4.9807 6.1978 7.6744 8.1551 5.3990 7.0930 7.0313 5.2922 2.9634 5.2729 1.5168 1.5079 2.0436 7.7995 4.8196 2.0817 1.6334 2.8149 3.4445 1.2572 1.9342 2.1390 2.4718 3.5788 1.2519 3.3599 3.8563 6.0164 3.6090 3.0956 1.5433 1.0485 1.0866 6.2616 4.6563 5.8849 5.0491 7.1246 5.8041 2.1135 1.8159 2.6001 3.3565 1.0324 1.1044 1.1005 1.0922 1.0917 1.0922 1.0443 1.0456 1.1047 1.1034
irintensity: 1.1094 6.9799 0.1398 0.5235 0.2567 2.2234 3.6537 0.2236 4.6619 0.8061 1.9676 0.2701 12.0442 0.3068 1.4132 0.7826 1.2915 13.8333 1.5780 53.5674 44.5356 66.4661 132.3578 1.3291 6.9626 133.2374 51.1703 10.9479 96.5058 8.8948 11.4940 39.8819 8.1250 10.7457 3.0934 1.8415 33.1711 37.4713 8.8176 30.3376 11.3172 0.2338 5.7483 44.9962 14.1410 173.0078 0.1555 6.8732 96.9904 6.4732 0.0987 12.3024 67.0009 54.7053 289.1142 18.8026 55.8236 20.9111 109.6409 159.4546 40.8261 24.5633 15.0063 61.6587 216.5683 278.4779 4.2475 34.8759 103.7510 113.1493 498.3880 231.6291 12.1265 188.4618 71.3804 40.2367 24.8369 7.2190 6.8175 0.2294 179.1522 134.1144 59.6730 36.3979
temp: 298.150 k
press: 1.00000 atm
elementType: 35 35 8 8 7 7 6 6 6 6 6 6 6 6 6 6 6 6 6 6 1 1 1 1 1 1 1 1 1 1
symmnumber: 1
zpe: 554842.6 jmol-1
zpe.correction: 0.211328 hartree
zpe.thermalcorrener: 0.229822 hartree
zpe.thermalcorrenthalpy: 0.230766 hartree
zpe.thermalcorrgfe: 0.163732 hartree
zpe.sumelectzpe: -824.984152 hartree
zpe.sumelectthermal: -824.965658 hartree
zpe.sumelectthermalent: -824.964714 hartree
zpe.sumelectthermalfe: -825.031748 hartree
dipole: 2.0272 -0.6181 0.0009
dipole: 2.1193
quadrupole: -87.4328 -132.2438 -139.9059
quadrupole: -12.3567 -0.0908 0.1078
quadrupole: 32.4281 -12.3830 -20.0451 -12.3567 -0.0908 0.1078
hfenergy: -825.19548 hartree
pointgroup: C01 [X(C14H10Br2N2O2)]
dipole: 0.8172053 0.165203 -0.0108488 debye
polarizability: 388.875177|4.1527516|260.4638901|-12.959514|27.7068148|83.2047555 unknown
InChI: InChI=1S/C14H10Br2N2O2/c1-20-10-4-7-11(12(16)13(10)18)5-2-8(15)9(17)3-6(5)14(7)19/h2-4H,17-18H2,1H3
charge 0 multiplicity 1
30 atoms
Br 0.67655 3.426888 0.395933
Br -4.903589 2.181738 0.449339
O  4.602462 -0.018445 -0.303359
O  -0.080576 -3.033587 -0.558175
N  3.628155 2.395342 0.10911
N  -5.141358 -0.93739 -0.019042
C  0.391321 0.510258 -0.037605
C  -1.092737 0.39241 0.009687
C  0.934031 -0.797881 -0.261464
C  -1.433751 -0.981858 -0.185778
C  -0.171066 -1.784761 -0.364032
C  1.291986 1.57836 0.086453
C  2.317325 -1.041786 -0.359173
C  -2.13029 1.323597 0.197811
C  -2.7490 -1.437261 -0.198074
C  2.706183 1.378589 -0.006186
C  3.196572 0.042426 -0.232703
C  -3.82371 -0.506758 -0.009478
C  -3.466155 0.860546 0.18462
C  5.199489 -1.33576 -0.535677
H  2.665623 -2.064479 -0.528889
H  -1.931888 2.385381 0.352282
H  -2.959986 -2.501859 -0.351572
H  3.329617 3.353335 0.275756
H  4.61582 2.162416 0.033231
H  -5.901738 -0.274966 0.115676
H  -5.361203 -1.917927 -0.165601
H  4.949793 -2.03398 0.285741
H  6.285262 -1.163915 -0.56427
H  4.860056 -1.759072 -1.500261
